##TITLE=	R9
##JCAMPDX=	6.0	$$ NMR Plug-in v.1.10 of MestReNova 9.0.0-12821
##DATATYPE=	LINK
##BLOCKS=	3
##ORIGIN=	Bruker BioSpin GmbH
##OWNER=	nmrsu
##TITLE=	R9
##JCAMPCS=	3.7	$$ Molecule Plug-in 1.6 of MestReNova 9.0.0-12821
##ORIGIN=	Bruker BioSpin GmbH
##OWNER=	nmrsu
##BLOCKID=	1
##ATOMLIST=	
$$ AN	AS	NH
	1	N	 
	2	N	 
	3	C	 
	4	C	 
	5	C	1
	6	C	 
	7	O	 
	8	N	1
	9	C	 
	10	C	1
	11	C	1
	12	C	1
	13	C	1
	14	C	1
	15	N	 
	16	N	 
	17	C	1
	18	C	 
	19	C	 
	20	C	 
	21	N	 
	22	C	 
	23	C	1
	24	C	1
	25	C	 
	26	C	1
	27	C	1
	28	Cl	 
	29	C	 
	30	C	1
	31	C	1
	32	C	 
	33	C	1
	34	C	1
	35	Cl	 
##BONDLIST=	
$$ AN1	AN2	BT
	1	2	S
	2	3	D
	3	4	S
	4	5	D
	1	5	S
	6	7	D
	6	8	S
	4	6	S
	9	10	S
	10	11	D
	11	12	S
	12	13	D
	13	14	S
	9	14	D
	3	9	S
	15	16	S
	16	17	D
	17	18	S
	18	19	D
	15	19	S
	20	21	T
	18	20	S
	22	23	S
	23	24	D
	24	25	S
	25	26	D
	26	27	S
	22	27	D
	25	28	S
	15	22	S
	8	19	S
	29	30	S
	30	31	D
	31	32	S
	32	33	D
	33	34	S
	29	34	D
	32	35	S
	1	29	S
##MAXRASTER=	32768
##XYRASTER=	
$$ AN	X	Y	Z
	1	-8295	-4779	0
	2	-3915	-9159	0
	3	1603	-6347	0
	4	635	-229	0
	5	-5483	739	0
	6	5014	4150	0
	7	3411	10134	0
	8	10905	2236	0
	9	6968	-9444	0
	10	6968	-15639	0
	11	12333	-18736	0
	12	17697	-15639	0
	13	17697	-9444	0
	14	12333	-6347	0
	15	21568	5093	0
	16	24665	10458	0
	17	20521	15061	0
	18	14862	12541	0
	19	15509	6381	0
	20	9497	15639	0
	21	4133	18736	0
	22	24088	-565	0
	23	30248	-1212	0
	24	32768	-6871	0
	25	29127	-11882	0
	26	22966	-11235	0
	27	20446	-5576	0
	28	31646	-17541	0
	29	-14413	-5748	0
	30	-18312	-934	0
	31	-24429	-1903	0
	32	-26650	-7686	0
	33	-22751	-12500	0
	34	-16633	-11531	0
	35	-32768	-8655	0
##END=	

##TITLE=	R9
##JCAMPDX=	6.0	$$ NMR Plug-in 1.10 of MestReNova 9.0.0-12821
##BLOCKID=	2
##DATATYPE=	NMRSPECTRUM
##DATACLASS=	NTUPLES
##NUMDIM=	1
##ORIGIN=	Bruker BioSpin GmbH
##OWNER=	nmrsu
##.OBSERVEFREQUENCY=	400.029998779296875
##.OBSERVENUCLEUS=	^1H
##.SOLVENTNAME=	CDCl3
##.PULSESEQUENCE=	zg30
##LONGDATE=	2014/05/01 13:51:00.000
##.ACQUISITIONMODE=	SIMULTANEOUS (DQD)
##$ORIGINALFORMAT=	Bruker XWIN-NMR
##$PARAMETERFILE=	(acqus, ASCII, C:/Users/Administrator/Desktop/1/20140502LV/R9/1/acqus, 0)
$$ ##TITLE= Parameter file, TOPSPIN		Version 3.2
$$ ##JCAMPDX= 5.0
$$ ##DATATYPE= Parameter Values
$$ ##NPOINTS= 11	$$ modification sequence number
$$ ##ORIGIN= Bruker BioSpin GmbH
$$ ##OWNER= nmrsu
$$ $$ 2014-05-01 13:51:05.298 +0800  nmrsu@CZC2222X4G
$$ $$ D:/data/xu/nmr/R9/1/acqus
$$ $$ process C:\Bruker\TOPSPIN\prog\mod\shimcntl.exe
$$ ##$ACQT0= -1.94957977583428
$$ ##$AMP= (0..31)
$$ 100 100 100 100 100 100 100 100 100 100 100 100 100 100 100 100 100 100
$$ 100 100 100 100 100 100 100 100 100 100 100 100 100 100
$$ ##$AMPCOIL= (0..19)
$$ 0 0 0 0 0 0 0 0 0 0 0 0 0 0 0 0 0 0 0 0
$$ ##$ANAVPT= -1
$$ ##$AQSEQ= 0
$$ ##$AQ_mod= 3
$$ ##$AUNM= <au_zg>
$$ ##$AUTOPOS= <12 >
$$ ##$BF1= 400.03
$$ ##$BF2= 400.03
$$ ##$BF3= 400.03
$$ ##$BF4= 400.03
$$ ##$BF5= 400.03
$$ ##$BF6= 400.03
$$ ##$BF7= 400.03
$$ ##$BF8= 400.03
$$ ##$BYTORDA= 0
$$ ##$CAGPARS= (0..11)
$$ 0 0 0 0 0 0 0 0 0 0 0 0
$$ [...]
$$ 130000 130000 130000 130000 130000 130000 130000 130000 130000 130000 130000
$$ 130000 130000 130000 130000 130000 130000 130000 0 0 0 0 0 0 0 0 0 0 0
$$ 0 0 0 0 0 0 0 0 0 0 0 0 0
$$ ##$ShimPowMaxUG= (0..63)
$$ 524287 524287 524287 524287 524287 524287 524287 524287 524287 524287 524287
$$ 524287 524287 524287 524287 524287 524287 524287 524287 524287 524287 524287
$$ 524287 524287 524287 524287 524287 524287 524287 524287 524287 524287 524287
$$ 524287 524287 524287 524287 524287 524287 0 0 0 0 0 0 0 0 0 0 0 0 0 0 0
$$ 0 0 0 0 0 0 0 0 0 0
$$ ##$ShimPowRcbType= 3
$$ ##$ShimPowRes= (0..63)
$$ 1e-020 1e-020 1e-020 1e-020 1e-020 1e-020 1e-020 1e-020 1e-020 1e-020 1e-020
$$ 1e-020 1e-020 1e-020 1e-020 1e-020 1e-020 1e-020 1e-020 1e-020 1e-020 1e-020
$$ 1e-020 1e-020 1e-020 1e-020 1e-020 1e-020 1e-020 1e-020 1e-020 1e-020 1e-020
$$ 1e-020 1e-020 1e-020 1e-020 1e-020 1e-020 1e-020 0 0 0 0 0 0 0 0 0 0 0
$$ 0 0 0 0 0 0 0 0 0 0 0 0 0
$$ ##$ShimPowRng0= (0..63)
$$ 1 1 1 1 1 1 1 1 1 1 1 1 1 1 1 1 1 1 1 1 1 1 1 1 1 1 1 1 1 1 1 1 1 1 1 1
$$ 1 1 1 1 0 0 0 0 0 0 0 0 0 0 0 0 0 0 0 0 0 0 0 0 0 0 0 0
$$ ##$ShimPowRng1= (0..63)
$$ 1 1 1 1 1 1 1 1 1 1 1 1 1 1 1 1 1 1 1 1 1 1 1 1 1 1 1 1 1 1 1 1 1 1 1 1
$$ 1 1 1 1 0 0 0 0 0 0 0 0 0 0 0 0 0 0 0 0 0 0 0 0 0 0 0 0
$$ ##$ShimPowRng2= (0..63)
$$ 1 1 1 1 1 1 1 1 1 1 1 1 1 1 1 1 1 1 1 1 1 1 1 1 1 1 1 1 1 1 1 1 1 1 1 1
$$ 1 1 1 1 0 0 0 0 0 0 0 0 0 0 0 0 0 0 0 0 0 0 0 0 0 0 0 0
$$ ##$ShimPowRng3= (0..63)
$$ 1 1 1 1 1 1 1 1 1 1 1 1 1 1 1 1 1 1 1 1 1 1 1 1 1 1 1 1 1 1 1 1 1 1 1 1
$$ 1 1 1 1 0 0 0 0 0 0 0 0 0 0 0 0 0 0 0 0 0 0 0 0 0 0 0 0
$$ ##$ShimSysFunc= (0..63)
$$ 1 2 3 4 5 6 7 8 9 10 0 37 38 35 16 15 14 13 12 11 28 27 26 25 24 23 36
$$ 22 30 29 20 21 34 33 32 31 17 18 19 0 0 0 0 0 0 0 0 0 0 0 0 0 0 0 0 0 0
$$ 0 0 0 0 0 0 0
$$ ##$ShimSysMatrix= 0
$$ ##$ShimSysType= 4
$$ ##$TFXNUM= 0
$$ ##$TRIPLO2= 0
$$ ##$VTU= 2
$$ ##$VTUETH= <149.236.99.20>
$$ ##$VTUTY= <no>
$$ ##$WBREFAM= (0..15)
$$ 140 110.6 100 100 100 100 100 100 100 100 100 100 100 100 100 100
$$ ##$WBREFLM= (0..15)
$$ 0 0 0 0 0 0 0 0 0 0 0 0 0 0 0 0
$$ ##$WBREFPH= (0..15)
$$ 72.2 -69.11 0 0 0 0 0 0 0 0 0 0 0 0 0 0
$$ ##$WBSGU= (0..15)
$$ 0 0 0 0 0 0 0 0 0 0 0 0 0 0 0 0
$$ ##$XFAC= 2
$$ ##END=
$$ 
##$DECIM=	2496
##$DSPFVS=	20
##NTUPLES=	NMRSPECTRUM
##VARNAME=	FREQUENCY,	SPECTRUM/REAL,	SPECTRUM/IMAG,	PAGE NUMBER
##SYMBOL=	X,	R,	I,	N
##VARTYPE=	INDEPENDENT,	DEPENDENT,	DEPENDENT,	PAGE
##VARFORM=	AFFN,	ASDF,	ASDF,	AFFN
##VARDIM=	65536,	65536,	65536,	2
##UNITS=	HZ,	ARBITRARY UNITS,	ARBITRARY UNITS,
##FIRST=	6199.4808349609375,	4.9541878700256347656,	-0.12958417832851409912,	1
##LAST=	-1813.2172116041183472,	4.9884457588195800781,	3.0326683521270751953,	2
##MIN=	-1813.2172116041183472,	-2.1878900527954101562,	-1411.643310546875,	1
##MAX=	6199.4808349609375,	2843.364013671875,	1536.440673828125,	1
##FACTOR=	-0.12226593494415283203,	0.035542050170898439876,	0.0192055084228515624,	1
##PAGE=	N=1
##DATATABLE=	(X++(R..R)), XYDATA
$$ [...]
-11819B36n2K1MJ2q3O6N3j3o2J1NL6m8M2o6L9k0lK1K2j4o7J14m5J2o5J4O4j00M3K3o2Q4J9
-11785B41l7L7m4L8Jqp9N1K6l6j1L9n0P7p3K3L0o0m1M7M0Ko8M0j9R2l2p8%J3N4k0P6o3OLM1
-11748B58o2j2M0m0L6k3qn2O7m5O5qJ0Q3j06L1Qm3J8K2j0j4m0j2N9Kk2J1J4p9N6n5J24k4m8
-11713B01m3R8l3n1L0N9n9j2QL9m4n1J13j07Q9k3n5N7J1L0qn2P0q4J3n6Q3k9o5O0L7l5R9r4
-11679A96R4p3m4J3K9jn3OJ9K8l9L2J1PN8o2m1Q6m9p4P0l7K5J3m3JM9L2o2k7M9MK2J7m2K5
-11643B39p9N2J5%N8m1l5n1L9l5L1K9q0O3MM6j18J22j3q5O3lk2j9O2p8J18q0m8K6%O0k9J7
-11609B28p9J23J3m6r3P1J9N5o2l2l3P1j5l8J3m6Q0lo0J0L7J8n3j1N8Nk5K2rn9K4P5l6J1K7
-11574B60n1k6lM6k1O1k1r6P9J6n5L4l3M1p2R9J8j05J7j6P9J6q8n0P5k6K3J02n9m4J0l3P2
$$ y = [236, 184, 205, 209, 221, 138, 204, 257, 244, 182, 193, 198, 234, 186, 228, 162, 201, 181, 178, 199, 221, 207, 140, 254, 209, 221, 156, 170, 234, 134, 177, 200, 138, 222, 241, 204, 241, 197, 235, 236, 228, 149, 200, 226, 190, 179, 218, 168, 245, 172, 195, 225, 165, 124, 171, 211, 213, 145, 185, 166, 258, 226, 148, 148, 161, 215, 195, 271, 208, 214, 217, 258, 196, 184, 224, 184, 220, 197, 189, 137, 204, 159, 224, 216, 226, 309, 203, 234, 242, 199, 217, 239, 229, 215, 175, 163, 222, 224, 202, 213, 227, 148, 204, 149, 273, 249, 201, 158, 256, 223, 172, 202, 261, 202, 190, 198, 237, 193, 142, 255, 148, 237, 214, 159, 216, 227, 257, 249, 197, 267, 183, 196, 140, 223, 194, 129, 189, 226, 191, 290, 196, 290, 217, 173, 186, 215, 214, 161, 167, 186, 214, 175, 207, 218, 225, 283, 221, 180, 266, 217, 143, 213, 176, 201, 214, 171, 172, 221, 253, 191, 164, 213, 217, 239, 256, 214, 239, 160, 212, 227, 227, 285, 244, 209, 158, 197, 162, 193, 222, 142, 205, 209, 255, 137, 259, 246, 161, 224, 221, 199, 180, 242, 164, 282, 202, 154, 180, 180, 240, 211, 228, 149, 272, 285, 239, 146, 217, 236, 291, 229, 197, 164, 235, 220, 182, 195, 149, 229, 226, 166, 176, 213, 231, 178, 167, 225, 230, 205, 227, 218, 159, 183, 258, 222, 233, 260, 209, 183, 180, 226, 205, 266, 245, 149, 228, 244, 189, 223, 190, 231, 159, 258, 276, 171, 188, 172, 251, 267, 179, 129, 204, 178, 201, 303, 244, 200, 210, 177, 249]
-11541B49m2qm6L6J5M9K6J6j08n3M8M3n6Qk0K9L0J8no6J5k3M9lq0J17m1j3J2qK2Q0k5n9M5
-11506B51Ko2R0q7M6k4k8k7P8k4j8O1q7N4m3J23m3q6L1pk0J0Q5om4l4J4k0J5K6Rl0m0N6j4
-11471B07k5O1j7L6j23J52k5o6K0l0Kl0J00q4L9Nl5j0J08r5m3O0oJJm5N8oNll6l6Q8n3kN1
-11435B24Pn8M9j5Ro5Q4q8J08l4L8l7k6m4QJ03q7J7L8l6o6J40n2L3J8q0RN1n7P2m5nN9n3j5
-11400B04MJ7k6L6m2L5J8mK6po9L0l7K6M8p5K5l4N5Rp5Q8r1M8j3N0m8o9J70j04J3o3Q5r2O9
-11365B07Mk7K6k7O9j29R0L7o6%M4N2m9k2n0MOK8lL2n6j4pM8M1n1Lk2P6n9O2n1l4N4m7j2K7
-11328A84P5o2m8Q7J3j6J4l3qL2Q7o9Kk5m0L4l9M9k1M6q9k4N1k2l0J06l1o9Q7m9m2N8j2N1
-11294B47p5O7q1m3P8K1J8j3k5R6q4rL4n6K9O6r4P4Qp5N6j29P1N6Ln3J6J8pJ3m5N5Qr6L6L3
$$ y = [249, 207, 199, 153, 189, 204, 253, 279, 295, 187, 134, 182, 225, 169, 177, 157, 186, 216, 234, 229, 163, 178, 155, 204, 201, 121, 238, 197, 184, 196, 188, 210, 290, 265, 206, 251, 253, 191, 281, 194, 240, 216, 188, 161, 239, 215, 197, 258, 171, 225, 182, 305, 262, 176, 207, 200, 180, 190, 275, 269, 225, 191, 205, 185, 200, 226, 235, 205, 165, 221, 207, 182, 243, 226, 262, 139, 291, 266, 200, 220, 190, 192, 162, 262, 178, 217, 222, 187, 177, 285, 190, 147, 207, 201, 202, 203, 158, 216, 210, 215, 212, 176, 140, 228, 175, 173, 224, 231, 173, 222, 207, 216, 151, 235, 147, 255, 221, 259, 222, 196, 152, 160, 263, 176, 193, 231, 195, 129, 269, 217, 250, 268, 188, 197, 248, 191, 263, 218, 213, 272, 219, 204, 208, 225, 199, 235, 193, 228, 246, 242, 268, 261, 192, 222, 185, 211, 259, 184, 209, 175, 230, 239, 164, 252, 161, 209, 196, 246, 198, 129, 299, 195, 208, 145, 230, 138, 207, 211, 184, 210, 183, 252, 123, 213, 250, 184, 184, 228, 280, 231, 209, 159, 163, 169, 197, 194, 226, 170, 156, 149, 197, 238, 187, 190, 168, 244, 185, 247, 196, 162, 216, 169, 157, 184, 259, 197, 149, 236, 249, 233, 247, 214, 206, 238, 325, 256, 258, 233, 193, 227, 188, 237, 216, 262, 173, 149, 200, 178, 148, 254, 223, 154, 241, 192, 150, 208, 196, 247, 172, 239, 158, 115, 193, 214, 232, 219, 194, 290, 206, 197, 231, 175, 204, 270, 176, 250, 258, 183, 239, 110, 181, 237, 240, 187, 203, 221, 214, 227, 182, 237, 245, 149, 185, 218]
-11258B18Kpk7j9m8R6L6o4P5n7nN8j54R8P7n7k6j3n2Q9o3R5Pm2K5j3L7j04OJ03m8n7j3J0L0
-11223A93nL9j6n8K4q9J03N7J1j19M7L5Pl0Rk4J4l0K8R4m3Rm5lo2pP9k9L0N2p8j0N3r2J7L
-11187A64jN5o4J4M2O2j26P3m8J1J6p2P6k6o0nM5P2L5o5oL6j13R7OJj7K4m0J4j9K3J3NO4%
-11151B86lk6n5n7P7N4p5M1L2p4J1j2j7P5k9o3M2n8Q4qo2N9l7PN9j30O4M3p5M4o3N2lL9m9
-11116A73K5J1k0M9j05Q3J9k7k9Q2o4J5K0n2M8l9L9n1J4LM0N4j23R1j20O4J1r6Q9k9M0K7n6
-11083A86N0n5L4o0Q2j00K4J07o3NNQJ3j6Jm1M4m6J04o0K6%k7k%o2l0J16j06Q2o6N1K9l9j5
-11048A79N0J2j9K3q1kK0j0L6J08r4r9L4n1J05k2k4kO3m5k4O7p2R4j06O6N6j62Q2L1m5K6n1
-11015A43K5Q2l9o7L4J5Mm9P2kq8J06m1nm3L3j9N0j8L4k3l5J6N5Qq5J7L9p5M0j3oM0l2N6K5
$$ y = [218, 220, 213, 186, 167, 119, 215, 251, 187, 262, 205, 200, 258, 104, 202, 279, 222, 196, 183, 131, 220, 157, 252, 259, 217, 242, 229, 266, 162, 168, 271, 223, 166, 153, 163, 193, 188, 227, 211, 153, 177, 88, 191, 248, 259, 140, 187, 222, 229, 199, 208, 184, 198, 168, 196, 290, 247, 256, 211, 208, 146, 139, 218, 189, 219, 271, 193, 183, 236, 144, 161, 164, 163, 218, 154, 168, 210, 272, 146, 219, 171, 182, 198, 126, 202, 176, 116, 111, 156, 228, 263, 198, 192, 228, 115, 212, 218, 219, 202, 226, 186, 200, 181, 204, 217, 222, 286, 286, 283, 257, 202, 145, 222, 276, 201, 242, 274, 200, 211, 199, 182, 257, 228, 165, 207, 149, 233, 225, 163, 222, 185, 192, 251, 121, 185, 228, 153, 197, 134, 186, 183, 222, 173, 198, 209, 189, 238, 133, 216, 235, 208, 179, 261, 197, 212, 232, 180, 228, 189, 228, 177, 191, 194, 234, 288, 165, 256, 136, 200, 211, 115, 204, 175, 215, 242, 186, 236, 181, 215, 155, 237, 137, 161, 268, 205, 210, 215, 223, 236, 220, 221, 180, 224, 178, 282, 222, 248, 248, 221, 219, 219, 157, 127, 243, 137, 219, 153, 204, 233, 194, 179, 229, 241, 222, 245, 164, 162, 182, 172, 208, 316, 222, 123, 157, 106, 211, 189, 165, 163, 226, 181, 157, 224, 152, 246, 140, 206, 262, 100, 182, 213, 168, 194, 143, 168, 250, 211, 144, 178, 193, 197, 148, 220, 218, 130, 236, 195, 190, 147, 180, 161, 211, 193, 227, 204, 169, 185, 240, 248, 163, 180, 219, 144, 184, 171, 165, 205, 173, 229, 254]
-10979B54j30R9K1o2K7JJ3O6n8j9m9Q7n2L0n0j3K6Q6p4KRl5K8j3o9L3R7p1J4nJ8m5n1P1K1
-10944B07N3r7Q7o4K7j21J65j12L4K6l4O8m1j1k4J4R7r9Q0p7K1L8k6PN8o5qM6l7L2%m2L4J1
-10910B47l6m4J4M2n2L1j1L1p7P7k6m8M6J5p3Q2q8J05k6kl4P8m2N7o4%l5o2P1O1j2o9L5M1
-10876B32K3j7n3k9j4M8M3q1k3J7NJ21j09P8M9r8n1J5K0L6k2J3l9ML8O7o1l8MP3j37R0K8o0
-10842A72M7o2P5j20N1j6J6n9J34o7k2O8n7L5N4r4k1Qj4J04r6L4M6k0OK4q0P4p2j5N2O5p8
-10809A72n5N8j1k3j0N8N1p5K3k3N6J0n4ok5R9r2O2n3K9j3J2m7J16j9j31J29rj15N9j0K6l7
-10776A52K4K5l1J3m0M1k7l4j7J11l5K3m9N4J1J4l4L9l3LL8J6r0L2lK7j6q5J4P1j0J7j17K4
-10742A28J25m3lo8Q5j4p5J18m2m4J18p4k3jK8J1l0q4N9N1K5l2J8r6P9j22Q9N9n5m2J05p5
$$ y = [254, 124, 223, 244, 182, 209, 210, 223, 289, 231, 212, 163, 250, 198, 228, 178, 165, 191, 277, 203, 205, 214, 179, 207, 194, 125, 158, 255, 184, 198, 193, 211, 166, 115, 186, 207, 260, 163, 250, 186, 213, 92, 257, 145, 179, 205, 171, 239, 198, 187, 163, 177, 274, 175, 255, 178, 199, 237, 211, 218, 276, 211, 203, 249, 212, 244, 244, 202, 236, 247, 211, 167, 181, 223, 171, 202, 191, 222, 145, 222, 196, 148, 194, 209, 136, 218, 130, 235, 209, 207, 173, 251, 209, 266, 202, 202, 167, 105, 176, 237, 225, 156, 191, 232, 255, 238, 185, 156, 142, 190, 233, 152, 129, 146, 151, 272, 163, 241, 290, 192, 141, 156, 176, 212, 190, 203, 164, 168, 206, 273, 212, 174, 178, 251, 114, 204, 232, 172, 219, 157, 232, 112, 163, 147, 163, 104, 238, 171, 149, 217, 160, 195, 249, 155, 134, 142, 128, 232, 136, 170, 216, 196, 202, 226, 146, 220, 148, 133, 185, 250, 172, 117, 175, 164, 141, 131, 189, 240, 165, 188, 165, 221, 231, 177, 171, 146, 245, 153, 215, 162, 191, 178, 190, 143, 259, 240, 109, 238, 229, 114, 173, 163, 189, 152, 176, 201, 170, 183, 143, 184, 157, 123, 106, 217, 182, 205, 156, 210, 221, 235, 201, 240, 207, 210, 248, 264, 174, 206, 203, 230, 214, 129, 143, 214, 204, 221, 104, 128, 253, 210, 207, 139, 224, 210, 135, 253, 211, 167, 285, 211, 188, 187, 215, 226, 196, 112, 171, 222, 247, 215, 233, 137, 216, 94, 183, 242, 187, 145, 250, 175]
-10710A75j5M6K4o0k1j1O4K7m8j0P3r2M8L3q5M0j9l5P3N3j14L1k5mj2L3j2K2M9p9N9l9lK2
-10676A88L7l2Qk7j0M1jOM4m2o5j4O6n9P8q6K1K4Q7n1p5Q8k8l1M4o5J10m1j9N9k9Rq4P2n8
-10641A65Q5J8pj01O0k4K1n6NL8l7N7m0j8J4K4o2M9L6j0lm7Mj5O9q8N1j9J9K9No0P4n5J2k9
-10605A64m8O2L9l4Q8m1r9R4n3k0M8n8K1m8J43j16O0K7k9j00K10j14Pp1P3NJ3m0L2joKK1o3
-10571A68K5oJ7m1P0K6r5P9k3l5m8K5Q1p2M0n9J1K5J3n4R9n8L1l9K3M7r3N7k6J4J8k3K5n8
-10537A64J7K8r8J25j24P1L5N3j70J01k9L8o8P6kM4l6j2L9q8N4J0j31N7J7P1p6k8P3o3M0p
-10505A81K8j1J3p6KM3j9K2L7j38J36M9r7K3o8R6no6LJ5L0kO9l4k2j1l4k1O5m4l7Q2q6L7j2
-10470A48M7KM6j6p6M0n3L5N0J0j9k7K2j1%mL6o4K6j9L6MJ7l3l9N7r0O7M0m5k0p6J07MK5p1
$$ y = [175, 160, 206, 230, 170, 149, 138, 202, 229, 181, 171, 244, 152, 200, 233, 148, 188, 169, 134, 207, 260, 146, 177, 152, 148, 136, 169, 157, 179, 228, 149, 208, 169, 166, 188, 225, 193, 201, 174, 164, 205, 204, 210, 254, 212, 147, 133, 199, 140, 218, 132, 153, 177, 264, 213, 138, 226, 198, 167, 211, 146, 256, 215, 196, 255, 226, 235, 151, 223, 165, 250, 268, 261, 160, 220, 196, 217, 161, 166, 204, 167, 224, 184, 166, 180, 204, 142, 191, 227, 217, 214, 167, 171, 156, 225, 137, 188, 169, 188, 217, 222, 162, 236, 181, 193, 164, 116, 178, 217, 183, 271, 230, 131, 225, 172, 152, 200, 142, 163, 115, 258, 142, 202, 229, 200, 100, 310, 196, 203, 132, 205, 210, 223, 183, 215, 214, 208, 210, 231, 168, 193, 187, 204, 163, 233, 259, 164, 243, 220, 185, 137, 162, 243, 171, 211, 152, 163, 188, 201, 147, 246, 188, 219, 180, 203, 250, 157, 214, 188, 202, 220, 197, 222, 164, 181, 209, 111, 236, 112, 183, 218, 271, 101, 202, 173, 211, 143, 219, 217, 261, 225, 213, 252, 164, 218, 228, 97, 154, 171, 242, 166, 138, 211, 148, 188, 181, 209, 198, 211, 135, 137, 180, 161, 183, 220, 82, 218, 267, 170, 193, 125, 221, 216, 150, 153, 168, 198, 196, 265, 231, 209, 198, 164, 143, 208, 164, 127, 209, 123, 160, 148, 195, 197, 243, 227, 151, 191, 138, 173, 223, 233, 214, 187, 209, 198, 198, 194, 230, 166, 192, 173, 209, 213, 230, 197, 158, 215, 125, 192, 232, 187, 167, 91, 198, 202, 227, 156]
-10434A56qO6mj05J14o4RM8k5Qn9k8J65j15k3K1PR4j30M7M2n5O0m2J01k9l9k7k7k8N0L5m8
-10401A67J0j9M8l5j9L9M5n0m7O8o5J1nK0n8O2n0P4mml2L8J6k5qj1jrP8m4p6L2N7m0j5L0O0
-10364B38J0%j28P8k3K2k6K9k2j7L0k6K9N0o0K3p5R8j07M8M9Nln0NM2J9o8R0j38R3K4k0m7
-10330A72K3m6N7K8m0qk9J8J8JK2l4P9n3K5j1p4P0l7lK2L6l2k7J2N3O5j73L2Q0k3J8m8n9K
-10295A36N0pn0M2nJ9j7QJLLjO8j06P5Ml4N7m6K7r4N1M3k2L4n8k6j2J7oL0k3N1n6kM9Kn0J3
-10256A68K5j4Pj0N1o1j6M7L1o5J7L0n8M2m2J7J00k6n8J1j2KJ5l6j9N1M0o5L4Ql0j4M3lj12
-10221I8R1lNn0K0QL9M9j09J4P6r7N4J8j8L5l5N0n8J0Jn2R0j06M7p9J10j39J10Qk9R5j13M4
-10187A84J5k6lk9N2rJ6K8qk8j3L2k4j9L7j8j5M3l3J1M5r1O2L2r7O7o1J15k9n0M6n5RM3k7
$$ y = [156, 148, 214, 210, 105, 219, 155, 164, 212, 187, 195, 136, 108, 273, 158, 135, 156, 163, 257, 127, 174, 216, 161, 221, 179, 280, 251, 212, 185, 158, 130, 180, 215, 167, 177, 158, 206, 171, 152, 191, 236, 186, 139, 207, 142, 153, 148, 168, 110, 172, 122, 196, 192, 188, 156, 194, 210, 185, 177, 166, 165, 156, 234, 190, 114, 146, 203, 163, 148, 178, 238, 248, 248, 120, 198, 175, 197, 171, 200, 178, 161, 191, 165, 194, 244, 184, 207, 132, 230, 123, 171, 220, 225, 222, 172, 177, 219, 238, 170, 260, 122, 215, 239, 219, 172, 195, 149, 206, 234, 194, 186, 157, 175, 193, 194, 216, 182, 261, 208, 233, 222, 148, 218, 181, 178, 200, 236, 204, 177, 189, 242, 307, 134, 166, 246, 223, 241, 193, 134, 136, 186, 179, 129, 171, 166, 185, 168, 176, 177, 180, 183, 182, 250, 144, 219, 223, 189, 246, 200, 227, 133, 184, 227, 205, 239, 181, 155, 143, 160, 154, 184, 161, 212, 156, 154, 203, 205, 155, 168, 193, 179, 186, 176, 227, 166, 150, 197, 228, 163, 180, 210, 152, 194, 152, 169, 269, 243, 185, 196, 184, 186, 201, 165, 146, 197, 237, 172, 206, 214, 184, 170, 213, 210, 98, 189, 186, 191, 141, 161, 169, 208, 257, 148, 162, 238, 141, 195, 213, 195, 230, 195, 245, 187, 197, 198, 146, 236, 130, 177, 98, 208, 69, 179, 187, 158, 253, 140, 184, 199, 173, 170, 141, 193, 184, 200, 228, 220, 192, 179, 211, 187, 168, 205, 187, 172, 215, 182, 193, 238, 147, 209, 241, 144, 211, 150, 265, 236, 186, 232, 177, 186, 229, 202]
-10152B02l5O7j6p3M1O9j21L9J3J3k5MN9q2N1O5j74Q8lM9o9J0K3M2k4K2j5k6k1N9m8L9k9N6
-10118B50q2pJ0N0L1m2%j05J70m4m0Ll1N5O1j10M7Km8J5rO5o1J36j08jJ14r4j8O4o0Q3l1o
-10084B59N5R8j03q0J1lL1L0m3J4j7j2J7l5L2l9N1j4k4P5l6o6O6n5j5k1P6m6m3k2M2Q6Nk8
-10050B46N0j04K2j1O7l6o0M9Ln1L4n8L0J3J8L8m0rK1m5j9K9N4n2L5n2lN6j9n0K5L2L5n3j5
-10015A80%J7K3nm1N3j4R6j05j00J00m1l2J00j6j8l9n0J3R1n9j8O7O3j34M7jM6K8k4p6mL9
-9982A86k0j5M7J1L4l6J2o2M2RL2l2p3J3P8l0n7L9LL3j7J3n2O5K4q4N7n5K7M8p5k5PJ33q2
-9947A98J1j5q1J16j8m0L2k5j8MJ07j68O8J8N2ol4kM1l1r7P8k9K3jn6J31o8J4m0M8n5qK7J3
-9912A89l1jM5K9j2J4j0k0m4P4o3RJ7j3L0Kj5j6J9p0M0j0K8K9q8O8j6q0J02m4j8K4M2n6Nj4
$$ y = [202, 167, 234, 218, 145, 186, 255, 134, 173, 186, 199, 174, 178, 237, 155, 206, 271, 97, 185, 182, 231, 162, 172, 195, 237, 213, 235, 220, 194, 173, 232, 184, 223, 194, 250, 168, 161, 171, 221, 252, 210, 210, 105, 275, 231, 191, 194, 163, 218, 279, 169, 216, 218, 170, 185, 176, 241, 180, 316, 208, 207, 321, 227, 209, 273, 213, 296, 265, 259, 314, 412, 309, 229, 240, 237, 268, 298, 255, 269, 252, 240, 257, 222, 254, 215, 266, 252, 228, 303, 267, 201, 267, 212, 197, 176, 252, 206, 163, 141, 183, 269, 274, 246, 296, 192, 214, 203, 270, 234, 174, 223, 226, 175, 209, 151, 181, 194, 212, 250, 210, 201, 222, 177, 158, 187, 241, 189, 224, 172, 169, 225, 206, 156, 181, 213, 248, 195, 180, 180, 197, 220, 215, 174, 227, 213, 309, 204, 104, 204, 163, 131, 231, 215, 197, 158, 108, 121, 212, 153, 135, 202, 265, 131, 178, 177, 223, 251, 227, 151, 147, 186, 166, 151, 198, 209, 243, 207, 219, 157, 199, 208, 240, 208, 135, 148, 226, 196, 139, 178, 181, 214, 197, 210, 158, 223, 247, 163, 220, 165, 192, 240, 165, 140, 147, 280, 198, 209, 194, 113, 229, 211, 171, 203, 178, 160, 164, 271, 103, 171, 189, 241, 235, 201, 199, 240, 209, 112, 190, 161, 184, 183, 127, 258, 190, 204, 164, 212, 157, 149, 176, 189, 158, 157, 202, 231, 219, 233, 223, 203, 159, 233, 170, 179, 196, 183, 213, 215, 200, 184, 203, 133, 173, 163, 191, 220, 132, 200, 184, 104, 206, 162, 144, 168, 210, 154, 159, 145]
-9876A45M8O0k1o3M0m9P9j14N0K6n3J3J1M3o8N4l9k7J12j23O3m1O8r8N6JK6M2q3M5m8O9o8
-9843A56l0P6k7k1l5qP3N3m1NPq2M2j9K1L4k3N8l9k0Q0j21KP3o1O2Qk7k7p3O5l7P9l6kM8m0
-9806A73J9N7j40O2M4o0J4N1M6j63K3N4J4J0M7k1r2J9L5k6K2J5m1L0K1j01J14nj00Q3l3L0
-9774B01n8jO5N5r9M7L6o5K3m0O0k0ll9k0N8j6ML7m0k0L1Po3K2K4J4KlOm5M9op3OL3N9n4M7
-9735B21O5j12r2P9L3l2M2JPp5m8J28o0N6Lj0l0L3Om4J33j02j4Jj5l6N5l3n9P0qN6n2P5r9
-9700A43R1m1l8j6J8O3J5p9l7N0k6m3J31r5qJ16p4jk5P8p8Q8Lk8r7K7P2P2N7l3l3M2p3K3N8
-9665C22r0l4jJ0j2Q4j15L1K6n0pJ4n2Q4m8N5Nj4N8j13N2m7J1L9j0j4j0Lj5L2n2OK6p0N2L7
-9629A93k9M7l9N7n3KK7l7k4L5j5N1J2o9Q4j40J68o6J2l1K7p8L0N8j1p1J29j10K3k1QK8l0
$$ y = [145, 193, 253, 232, 169, 209, 160, 239, 125, 175, 201, 148, 161, 172, 215, 147, 201, 162, 135, 247, 124, 187, 146, 214, 116, 172, 173, 199, 241, 158, 203, 155, 224, 156, 126, 202, 175, 154, 119, 111, 184, 237, 196, 201, 208, 126, 168, 149, 170, 204, 181, 239, 200, 180, 260, 139, 141, 214, 153, 215, 223, 196, 169, 96, 161, 124, 203, 167, 165, 213, 173, 192, 249, 109, 171, 215, 155, 169, 220, 266, 103, 126, 180, 194, 204, 251, 230, 138, 157, 192, 166, 188, 203, 162, 192, 213, 112, 226, 221, 121, 204, 171, 201, 143, 142, 207, 262, 163, 210, 246, 181, 204, 164, 224, 204, 201, 162, 142, 200, 184, 188, 225, 185, 165, 196, 203, 140, 162, 186, 200, 202, 199, 205, 160, 209, 203, 130, 136, 169, 228, 174, 221, 286, 174, 82, 161, 194, 162, 204, 205, 212, 137, 89, 217, 157, 213, 216, 206, 176, 209, 215, 171, 304, 202, 188, 189, 174, 138, 193, 160, 101, 171, 163, 219, 167, 242, 143, 234, 193, 155, 139, 157, 220, 235, 156, 119, 169, 143, 100, 231, 136, 128, 244, 170, 169, 144, 222, 144, 232, 235, 207, 110, 137, 209, 281, 338, 305, 272, 314, 241, 264, 322, 232, 198, 197, 207, 195, 279, 164, 195, 221, 171, 164, 178, 126, 210, 162, 217, 222, 208, 266, 153, 205, 158, 169, 208, 198, 184, 174, 177, 162, 194, 142, 148, 174, 104, 156, 193, 164, 211, 172, 229, 176, 178, 205, 168, 144, 179, 164, 215, 227, 158, 242, 102, 270, 204, 216, 185, 212, 134, 164, 222, 211, 140, 269, 159, 182, 161, 169, 197, 167]
-9596A67M2J2j16J05m7m0Q3jo7P9m0N0n6o3O5QN3o2ML7m3L0n1P7q4J26j19NK2mM0Mn1J7p1
-9561A11Q0K7Or4L4M5J2l9J4R%j8k4n6P7JM6p6N0l3J8kqpj6K6j7O9j17M1K5O3k8pp8J06o3
-9524A77J6q1J02Np6QM0K9k8l9R8q9l8J25m6m5Q0m6o1Q8j1n0l1N5J3P9m4k1K0p4K6q2P3N7
-9490B29K9m1m8j9J8kLK5m2k3P4n4R1j11O3N6k0p8K%KM0l9O8p2OM3m9M8n2J3Kl8L0Q0m7kk7
-9452A58K3l2Jj8R9m8j8K0K5ql4L2K6L2j1J2J7rQJ6n9K2J8rom1J2p8j1L8K7M3k9j08J07l4
-9416A83N6j8J4o5lj6l9P3M5p7o9J14mQ8j92N2M0M4m4J4L3p1N8l7J6J3Pjm6j9M7Qj5N3m4o0
-9380A38R3j32O2M4J8r8Q4k6k4N4q0m9J40l2o1L6m5N7k1RN3k2r3J06r8JJ2K2pN2j0j4m6P0
-9346A93J0m4N3l5o6N6J3k7N7km5L0l7k7K8N8r5OK0k8M4J9LlM1k0L2j7l3m1N9lr2J40n8q0
$$ y = [167, 209, 221, 105, 210, 163, 123, 206, 205, 138, 217, 177, 227, 171, 108, 173, 181, 234, 172, 176, 213, 170, 200, 149, 226, 142, 268, 149, 154, 176, 172, 212, 216, 165, 182, 111, 191, 218, 224, 130, 164, 209, 221, 182, 196, 205, 205, 187, 163, 107, 184, 185, 231, 155, 205, 172, 190, 188, 180, 173, 157, 183, 166, 235, 118, 159, 184, 247, 219, 212, 134, 240, 177, 193, 112, 214, 219, 143, 151, 191, 220, 192, 153, 251, 162, 124, 249, 203, 158, 238, 192, 131, 219, 208, 158, 127, 182, 195, 274, 230, 209, 229, 155, 181, 99, 172, 229, 258, 217, 169, 150, 168, 166, 169, 194, 152, 129, 203, 149, 240, 129, 192, 248, 228, 150, 152, 152, 154, 194, 155, 223, 151, 157, 200, 151, 199, 147, 160, 162, 124, 154, 234, 187, 185, 158, 181, 149, 150, 132, 231, 183, 165, 185, 210, 202, 168, 200, 226, 258, 247, 259, 276, 267, 275, 291, 232, 254, 272, 263, 257, 216, 228, 150, 139, 177, 204, 247, 218, 110, 217, 183, 239, 221, 235, 170, 167, 151, 112, 185, 230, 153, 84, 198, 194, 282, 90, 142, 182, 226, 182, 196, 229, 158, 216, 179, 195, 208, 215, 214, 168, 149, 196, 204, 189, 242, 198, 138, 231, 99, 161, 205, 223, 125, 209, 183, 159, 213, 133, 84, 224, 192, 131, 167, 122, 179, 158, 167, 220, 198, 105, 211, 113, 114, 126, 148, 141, 193, 183, 169, 123, 193, 203, 159, 212, 177, 111, 167, 180, 153, 210, 208, 163, 193, 156, 129, 157, 215, 120, 126, 146, 118, 162, 181, 184, 181, 222, 202, 234, 217, 184, 143, 202, 199, 107, 247, 189, 109]
-9310A09K9pP8q0K8oR0j81J29pm6L6K9m8oO5o0N9OJ6m6n3M9k6O1r1R9j06L1k6J37o5J1k1Q
-9275A95j1p6N7O7j8p5J7j0LQ5j14R0l2K4o4J40%j42Q7k6PO4o5j4j7j4N5o1j1K1j3p0J75j26
-9241A28J57j13%o1J02j0q5K2j5M5pm2L3j4OO0j8N4k9m6O7o8lj2L1j3Nj3L3k9J6jlnl6RM9
-9204A94J2l1k0L4k1O6M9j44N5p3M0q1P1M1l8l4P1r1N3Q2p6o5P1nK6K2p2J1LL8l3Q8j9k9l8
-9169A57J2R0m3Mk5m1Q1J0l8o6J16q5K3m8R9n4Jk6kj2J5j4N5n2N9l9Mn%J7J0N7j50J00J6J7
-9133B43q9M1j8O8o8J4j0L3l6o7j7J03M0n5km6N5M9oo4k1J7J6K5l7J9l1O9qq4N2o5M9J0n0
-9098A29N3mJ6K7m1N4k4n1J5m2P7o4M7K5pk5j5N5K2j02O3l1N2o1qK0O7m5j5PK4k3k6rN2nJ7
-9061B24J4Kk5O9j13NR7j24J26j27J3Q6r1K1M3m1n8N0L7M7o2OL8m1j9l3K2k0MP3l6j9Op8R0
$$ y = [109, 138, 131, 209, 129, 157, 151, 241, 60, 189, 182, 136, 172, 201, 153, 147, 212, 152, 211, 217, 233, 187, 134, 183, 157, 218, 127, 226, 120, 151, 125, 262, 197, 208, 187, 195, 184, 108, 165, 232, 214, 139, 156, 146, 149, 234, 120, 210, 178, 202, 138, 278, 278, 136, 223, 197, 204, 268, 203, 189, 172, 158, 213, 152, 141, 162, 149, 79, 254, 128, 285, 172, 172, 111, 213, 203, 118, 140, 125, 170, 163, 121, 154, 140, 146, 206, 188, 242, 213, 167, 234, 166, 163, 151, 182, 169, 174, 161, 194, 165, 181, 180, 177, 172, 136, 145, 194, 206, 175, 155, 189, 168, 234, 283, 139, 194, 121, 161, 80, 151, 192, 154, 120, 191, 100, 153, 235, 159, 94, 165, 160, 186, 208, 136, 147, 150, 188, 155, 243, 224, 195, 157, 169, 259, 216, 220, 195, 154, 235, 245, 207, 141, 257, 172, 195, 147, 246, 192, 193, 167, 165, 153, 168, 154, 209, 157, 216, 177, 181, 176, 176, 193, 203, 260, 110, 210, 226, 243, 154, 195, 177, 245, 177, 191, 181, 214, 178, 111, 94, 197, 237, 182, 180, 134, 189, 238, 232, 168, 147, 164, 180, 205, 168, 187, 156, 225, 217, 133, 185, 120, 169, 179, 129, 182, 178, 194, 221, 180, 234, 210, 159, 174, 132, 209, 145, 192, 217, 210, 185, 170, 225, 247, 145, 208, 177, 229, 168, 160, 180, 247, 202, 187, 194, 218, 195, 169, 160, 212, 207, 224, 238, 240, 215, 284, 171, 176, 273, 149, 275, 148, 161, 247, 156, 177, 220, 179, 121, 171, 208, 255, 193, 199, 237, 196, 177, 144, 166, 146, 150, 223, 187, 168, 174, 96, 186]
-9026A86ML9j5Rn8N1r2J36j16R2m9m5k1J27m7PN3r3K4K8l6L7l2j4m2L8m0M3O3k8j8Jm8Q5m8
-8991A81j05J58l4K6J8q7qL6l5l0M8m6N6p1P2ON7o9M8Jj3J9o0o8O0L1K2L2ok7o4Q4Jp6K0L9
-8955B16J0pj07O8M2j03J36j01j8NpQ3K3o5K9l0LKRNl7k0N3L4m7LM0l9m4j2J30l1p7J60j36
-8920A70k3P3m2nn0J6M7o8P3N0j1j5M1q0n2L1K1P2MNj02j6oN3j8M9J5k4l1J0N4l6m2N0J1p4
-8884A50O4O9L4j37Q0j2Kl7Om0N0J4k1k6%j3J3L0M3k9k0L5M0j32J27K7o3R0j01L1k8K9L1q7
-8850B19J0P4j25P2M5m0L6n5qM7j3Om3k2K0J0j40J59j00R8oj14K5L3RK6LQL7n0j2m9L8o8P8
-8815B08l9m6J07o8J5J4k5k1L4N5m6m1Q9k1k9l0K6M9j08L7p6R3Q4j18L0NK7J6k0L7o1k9o0
-8782H8P1N6n4rJ9l4k5K9J2O4l6l7Q1p2JR9n1L0p0j1M0Qo5l5Q8L4j41R8K5m2%J8j1K1k4L5
$$ y = [186, 190, 229, 214, 223, 165, 216, 124, 260, 144, 236, 187, 142, 121, 248, 201, 208, 261, 168, 192, 220, 184, 221, 189, 175, 133, 171, 131, 174, 237, 209, 191, 192, 144, 229, 181, 76, 234, 200, 226, 244, 157, 149, 185, 150, 120, 168, 122, 178, 107, 179, 185, 242, 173, 221, 222, 209, 228, 168, 100, 160, 191, 213, 245, 239, 212, 148, 232, 233, 157, 177, 216, 226, 219, 112, 180, 222, 119, 255, 154, 136, 141, 134, 217, 240, 175, 204, 174, 177, 179, 188, 193, 156, 136, 189, 223, 176, 179, 219, 180, 136, 124, 254, 223, 146, 306, 170, 147, 220, 178, 173, 123, 139, 186, 118, 191, 241, 230, 215, 256, 176, 124, 155, 176, 248, 252, 257, 155, 139, 133, 186, 168, 217, 232, 208, 177, 187, 241, 205, 163, 213, 224, 150, 214, 283, 317, 180, 260, 248, 250, 213, 219, 179, 229, 243, 222, 196, 196, 183, 196, 226, 269, 240, 220, 255, 295, 163, 290, 317, 254, 344, 243, 274, 246, 275, 306, 219, 229, 303, 178, 250, 295, 255, 291, 236, 228, 275, 262, 268, 225, 203, 223, 233, 93, 252, 152, 250, 244, 130, 155, 188, 197, 223, 226, 234, 271, 221, 209, 160, 198, 130, 208, 169, 123, 230, 162, 177, 191, 166, 145, 179, 234, 188, 147, 236, 215, 186, 156, 182, 231, 123, 160, 84, 177, 261, 143, 173, 178, 205, 221, 201, 238, 177, 148, 88, 159, 215, 161, 152, 171, 137, 112, 141, 153, 217, 181, 144, 225, 153, 154, 253, 202, 232, 162, 151, 191, 199, 134, 99, 187, 221, 80, 178, 203, 161, 161, 179, 168, 189, 165, 200]
-8746B00K1n0K4M7l0J3m0Jr5R2N8p0J12r6j3l5N6j5N0r0M2N2l8j03RL5J5R0j3m1J2j2J9M1
-8712B48P2o7L5J2k3j7r0P9q7L3j0m5O7k2j2j6J3JJ6j8O4l8o4J1K1Mqj7PK6M2o0L5o7Q5o8
-8676A42j9L5K6Kl1N4J6nj3k6P8j36M4pl0R2m1j7l3J33j76J16K7m9opk9J7J03j37L9P0j14
-8643A18O6pJ8L3p2L4N0o1M2j4k6j6L7l2L1N1j05O2LK7m9j3Pk3l5K3K5K0m1NR3j16K6rJ7L4
-8607B03p5MN7k7N9j1j19J54j94J85m7L1m3J3n6P4q8M3l8RO8K8k9j0j9L5lr0MJ56j57N1l8
-8574A30kN1k4n0Q0L6j39L8J3O1k8o4P8j4M8j5l2Q3J5m5QJJ2k6m8Q3j3l4o3L7MJ6MPq9%K0
-8537A39R2p1j5j05J32K8j8Lm5O4K6l5k0K2o2M3n3L4N5K5n8J4l6k1N3rR2p9lr3R8J8p7R3j40
-8502I1P5n3J06o8L8M3n8J4P2j2p3J5M7q1K0K5K3l5mQM6o3mM6N9n8l6J9o1J0J33j31L9k1m8
$$ y = [200, 221, 171, 195, 242, 212, 225, 185, 186, 91, 183, 241, 171, 283, 187, 174, 139, 195, 180, 230, 140, 182, 234, 196, 93, 102, 137, 152, 242, 229, 188, 200, 188, 207, 248, 320, 253, 288, 300, 277, 260, 170, 249, 162, 195, 185, 140, 207, 185, 173, 157, 170, 171, 187, 169, 233, 195, 131, 142, 163, 167, 159, 142, 149, 175, 217, 157, 192, 125, 210, 142, 123, 158, 184, 186, 155, 209, 225, 220, 207, 181, 259, 123, 167, 160, 130, 222, 181, 164, 131, 264, 88, 204, 231, 182, 176, 169, 140, 157, 260, 123, 162, 232, 118, 184, 177, 195, 228, 156, 190, 240, 179, 221, 207, 181, 165, 202, 170, 201, 252, 147, 209, 212, 239, 190, 177, 184, 161, 126, 149, 174, 194, 153, 158, 251, 135, 161, 152, 169, 203, 128, 132, 189, 162, 221, 210, 91, 245, 51, 236, 189, 220, 177, 190, 134, 208, 120, 163, 125, 134, 202, 230, 201, 191, 172, 207, 204, 114, 118, 274, 117, 168, 130, 128, 179, 155, 105, 185, 221, 82, 120, 133, 194, 166, 102, 180, 166, 214, 199, 167, 250, 265, 220, 228, 229, 241, 215, 167, 250, 237, 203, 140, 177, 181, 197, 201, 208, 119, 119, 139, 231, 160, 145, 40, 172, 200, 182, 185, 140, 204, 230, 195, 175, 197, 135, 178, 125, 159, 214, 239, 181, 195, 159, 138, 191, 182, 274, 195, 192, 99, 197, 215, 138, 231, 91, 166, 113, 219, 151, 189, 232, 174, 188, 260, 248, 175, 190, 237, 156, 176, 201, 224, 189, 185, 193, 239, 176, 172, 218, 277, 219, 183, 202, 141, 151, 284, 153, 192, 171, 123]
-8467A23%J58o2o7L6l8O2q9J3Q5p0K2K3l6M6J9j4p4M5p1N7J7mm9K5p3Q9j7L4o5J11j23P4o6
-8433A21M4k2N1J3o2J0K1J2L6m1p5Q5k3J0nrlJ9K8m1L5k1q4R3n4M5K1j0q0Q8jq2K5R4n1j2
-8397A75j4K7M2p7J2K0J0N2j3o1j1JL0o8J00j2k7j5ORLJ9N9j47Q8or8R8o0KJ3J7K0n2M0J6
-8361A98l7j8Q1k5J0oo8L4o7N6N2J8mM0p2OL0oq0oJ18j21J5K1J1K7j5k3K4R2n1n0k6J2M3L2
-8325B45q8J4L5K3m2nn2L5JK9Nn7J4k9O8l0R7j16k9NK2k1J00k7k7J35o6k0p2kR%j1L7j9L9
-8289B00Qq9O2j9O6rq0l7J23k3M0n9k1m3K0L3j0j7Q7p4j5M8K0kk7j6q4J13j8M0k7NK4rp7N
-8253A38K0j1L2Po5N4N1p4L9Jo0K1N8m7rOj1K3m9L4j8K6j8J06p3knn5L7N9m7j7P7j02L4rn2
-8216I9J12Lj02J15n1O5o3Mp2J01n2ML9J7m2M1J4r7j7J08%l7j4N0p0ON4K8j29K4L8J1L4NL
$$ y = [123, 123, 281, 219, 152, 188, 150, 212, 123, 136, 221, 151, 173, 196, 160, 206, 225, 211, 137, 182, 111, 168, 185, 181, 132, 157, 84, 173, 156, 190, 125, 236, 113, 187, 121, 165, 143, 194, 207, 145, 155, 176, 188, 224, 183, 108, 193, 170, 180, 175, 166, 163, 182, 210, 169, 204, 183, 99, 192, 138, 183, 204, 194, 114, 202, 201, 119, 144, 238, 187, 175, 161, 188, 230, 153, 165, 185, 195, 247, 234, 173, 162, 163, 193, 125, 225, 213, 186, 171, 177, 186, 189, 208, 267, 120, 208, 202, 104, 202, 142, 144, 157, 174, 194, 142, 182, 198, 161, 143, 224, 199, 209, 203, 135, 169, 102, 158, 210, 228, 224, 264, 192, 198, 228, 222, 142, 136, 254, 133, 148, 169, 180, 207, 192, 169, 193, 285, 234, 184, 158, 170, 213, 245, 157, 171, 206, 229, 187, 182, 130, 165, 166, 195, 200, 143, 157, 128, 196, 166, 263, 147, 118, 123, 145, 124, 224, 197, 170, 305, 239, 219, 147, 145, 154, 154, 143, 180, 161, 200, 208, 119, 181, 162, 228, 219, 139, 102, 225, 202, 242, 183, 162, 119, 139, 172, 162, 145, 232, 158, 143, 191, 211, 209, 182, 166, 82, 195, 177, 217, 190, 195, 219, 210, 133, 138, 158, 147, 179, 186, 121, 175, 226, 152, 191, 192, 132, 153, 211, 164, 155, 161, 150, 173, 124, 158, 140, 166, 148, 254, 181, 179, 174, 119, 156, 215, 168, 151, 228, 126, 160, 151, 99, 211, 214, 112, 227, 176, 241, 178, 182, 110, 211, 159, 163, 202, 219, 177, 218, 232, 135, 118, 226, 226, 189, 175, 225, 155, 161, 215, 243, 114, 138, 176, 187, 221, 226, 229]
-8181B29n4N4N1r3N0p8M9J2r2j8Q0L5o2M3l0K5o4N9rrj5N4Rj12M1J24j15J6j6Q1o5j8k8K7
-8147A61K3n0P3n1L6N1n9J7o1R4m2L2q1K3M1m1k2P6l6K6m2l9M3m7O0M6n8O4k3q3J03p9PO6
-8113B28j6n2jJ4Q5r2j2K9j9j1j8J9K8j1l3lk5J4K6M2o6NJ00o4J7J1J4LPNn7m1P9Qjn0%p4
-8075H8L1P6kj8L0l9L5n6P5o9L2l4O3j1L8o2o6J0N6O8j28O4j8L7j8j14Q2N2l5J4P5p5m1K9
-8041A69N6o7J2K1M4n7L2p5P4o5l7R7k1J4j6O1n5J3n5L3j9N5k2J0L7q2O0K4l3L6K5q9K4j7
-8007A87k9N5K4r1M0O4m7moj1P2J8q3J1m8Q5m0k5J3j5J7m5K8K0J2pp4J30N0j37O3j05J6R1
-7973B29m0j8j0nO1L2o1kJ3j0K9q2O1n4K8N5k7lo1O3pQ7j22M5m3J00l8lk5MK1m4o7NJ4Q1m7
-7936A59l4J02mK2q9O2l7mJ2%K6N1q1K0l8O9o1MM9k9J0KJ2N8l9j05Qj2RM9L1J0j3o2rN7l9
$$ y = [229, 175, 229, 280, 187, 237, 159, 208, 220, 128, 110, 190, 225, 163, 206, 176, 201, 137, 196, 187, 178, 163, 217, 226, 114, 155, 279, 164, 180, 164, 245, 180, 162, 134, 161, 184, 134, 207, 156, 192, 243, 184, 201, 140, 234, 192, 224, 143, 166, 207, 166, 144, 220, 184, 210, 168, 129, 172, 125, 185, 231, 173, 237, 214, 131, 234, 155, 162, 228, 212, 160, 159, 173, 258, 166, 154, 183, 164, 153, 135, 154, 182, 171, 138, 135, 110, 124, 150, 192, 126, 131, 231, 167, 184, 195, 209, 212, 219, 224, 167, 126, 205, 213, 212, 162, 162, 88, 119, 195, 193, 175, 205, 166, 201, 145, 220, 151, 183, 149, 212, 201, 239, 177, 111, 121, 177, 245, 117, 181, 163, 200, 182, 68, 150, 202, 167, 181, 256, 181, 140, 169, 225, 158, 170, 191, 235, 178, 210, 135, 209, 144, 107, 204, 183, 197, 181, 242, 187, 200, 145, 178, 159, 214, 192, 202, 239, 157, 217, 241, 208, 244, 269, 180, 204, 187, 158, 213, 237, 146, 186, 250, 203, 199, 193, 182, 254, 272, 189, 200, 152, 237, 197, 172, 185, 170, 187, 142, 170, 190, 202, 195, 121, 251, 301, 164, 227, 122, 138, 229, 189, 171, 161, 156, 217, 249, 188, 186, 199, 189, 218, 136, 197, 143, 171, 226, 199, 196, 135, 198, 191, 278, 156, 201, 158, 258, 220, 217, 192, 196, 217, 173, 106, 111, 125, 206, 159, 125, 227, 223, 245, 156, 218, 181, 177, 189, 189, 215, 266, 185, 205, 167, 236, 175, 179, 228, 199, 209, 211, 223, 281, 242, 137, 145, 133, 142, 191, 222, 232, 219, 157, 148, 205, 166]
-7899A66N5p9k0N2Mk0M2K4j9J9j6J1k8L6o3L7j9j5J0Q5Nj02M5o7j6R8p4K4J03p7j6K2JM0j25
-7864A23J37n7j5j1Q6k1J4l8j2l5L9k1L5m1O3m6k0M3k7Nm4R5k8m2m1K9J2J9j5Pm3J2J40q0
-7830B22m6N2K9k0q9P5p7J02j26M9k9Q4n2L5n3M3K3l9k3L0O2r7J6P8q0K9j1rL1PM8p3k0L1
-7796B02LL4q0K1jq4J26M7l8j9m1QK5l6O8p4M6LJ12j50O7p2N6l5L9l9J1J3mK7n0k4K0NM0r2
-7760A34J03q1M0m8L7j6J3j8R7l0q8L1K2j1L4nl9l5P7l5K1p1M1O6l0k5k3O2n7J1j7P1j4n4
-7726A63J26j3p5M8p6LR4r6m8P3oRQn0kK4L5j8J4p5N8J4M5j07J19k9Po4N9m7J04q9KRl8j0
-7690A71j4O5k7P0l6km3Pl1l1N4K9k1j0rk7M8l4n3PJ00k2m1J7O9j13QN1j0R4j11O1m5j2j4
-7655A45J3j4L6l2pP5p0Q7k4n1K7lL7l5j9kL1J2K3Mml2j6M1j01J05o1J1QpJ3K0n4rR2p7N1
$$ y = [166, 221, 142, 122, 174, 178, 158, 200, 224, 205, 224, 208, 219, 191, 227, 164, 201, 182, 167, 177, 262, 267, 165, 210, 143, 127, 225, 151, 175, 278, 201, 185, 207, 208, 248, 123, 260, 203, 188, 177, 263, 242, 256, 218, 206, 171, 210, 189, 224, 183, 246, 200, 180, 223, 196, 201, 157, 252, 224, 182, 141, 170, 182, 201, 186, 193, 150, 162, 302, 222, 176, 228, 257, 237, 148, 223, 146, 248, 122, 171, 142, 226, 174, 209, 156, 199, 222, 183, 160, 190, 252, 155, 171, 249, 169, 198, 187, 178, 209, 216, 264, 191, 171, 202, 205, 239, 159, 180, 179, 95, 221, 268, 230, 211, 170, 178, 203, 167, 235, 161, 207, 210, 322, 172, 239, 167, 223, 188, 227, 188, 199, 212, 208, 235, 185, 161, 181, 186, 226, 134, 237, 156, 196, 148, 185, 169, 182, 164, 261, 231, 143, 174, 196, 185, 219, 214, 175, 140, 217, 182, 203, 132, 173, 239, 209, 184, 161, 223, 166, 177, 160, 231, 217, 163, 289, 276, 201, 249, 173, 176, 270, 174, 126, 199, 193, 202, 210, 160, 158, 182, 217, 199, 213, 138, 196, 210, 255, 148, 267, 238, 245, 181, 240, 193, 297, 208, 210, 219, 181, 171, 157, 222, 195, 265, 229, 227, 184, 191, 160, 129, 183, 212, 191, 181, 172, 145, 193, 159, 106, 113, 213, 191, 150, 167, 236, 123, 131, 182, 172, 266, 155, 216, 171, 159, 145, 158, 144, 180, 148, 141, 216, 146, 233, 209, 158, 185, 182, 219, 184, 165, 163, 194, 206, 229, 233, 229, 197, 181, 222, 121, 226, 165, 176, 184, 177, 190, 210, 156, 147, 239, 162, 213]
-7618B13n5rL9K5Mk4o2J43q3J0kJ5m9k2L6L3j6J8o7L7j4Ro8L9Q2n1k5J03J1p1pjl1J0J3Q0
-7582B63l3J3j07J0O5k9O0o3l8O1j00J08J0j02Q4o1J5M4j0L6o6J10j29M5j4P4N0j19K0O5p9
-7551A83Kj3J6M8q3Q3%p9K8pl4Q8j40J23m6J5k6Ol7N4qm4N7j0L6J5j3n5N8k2K5j03R7jQk6
-7515A95L8l1K6m6l4P2k1q0J32j19Q4p9m9J00m7j2P4K0l1L3l4M4j39J23Ko5N4Qk5J2Nk9L3
-7482B14l7P4j21JJ45j6k3l5mL3n0N3n6j3L3K1j20J70p3l8OM6n8J5k4K7M4J0m9J03j77J9L9
-7449A59N6m4l6Q8l7L0m2K3k8Rj7N4n1N6q7J21r2lQ2%m3j9N2k1Nk5K2k0m7rM9m3M2p9R3K4
-7413B22n4O5n5Q9r2J3k2M8n6n2R1m8J0j6M1k6Pl4P8Jl8L5k7k1L3J7jk2K6M4l8o4pJ0L5J03
-7377B95j26J2L9k1rK1m2J17j20Q2j06K7n4Q6k1k8N2k7j6M4l0K2J5O8j12j6J8L0m9J04j08
$$ y = [213, 158, 149, 188, 213, 217, 193, 131, 274, 191, 201, 199, 214, 165, 143, 179, 212, 196, 214, 147, 184, 170, 179, 111, 150, 232, 181, 156, 259, 270, 199, 192, 191, 160, 170, 183, 263, 230, 243, 136, 146, 211, 182, 242, 179, 141, 202, 102, 210, 220, 118, 202, 141, 156, 200, 190, 226, 160, 270, 141, 186, 172, 246, 296, 177, 197, 262, 183, 185, 172, 188, 236, 153, 236, 236, 157, 185, 178, 144, 232, 92, 215, 169, 184, 158, 164, 127, 181, 173, 129, 186, 176, 212, 227, 214, 159, 217, 195, 220, 117, 214, 213, 221, 195, 233, 202, 228, 182, 148, 220, 199, 119, 251, 132, 216, 137, 88, 188, 141, 129, 203, 223, 192, 225, 191, 235, 96, 219, 221, 156, 210, 218, 193, 205, 210, 181, 214, 177, 251, 130, 131, 276, 260, 237, 202, 198, 231, 181, 234, 178, 165, 198, 219, 99, 269, 196, 158, 164, 210, 152, 167, 143, 170, 214, 224, 175, 278, 101, 120, 159, 215, 171, 135, 223, 186, 216, 174, 197, 169, 178, 161, 215, 164, 220, 133, 254, 162, 159, 241, 241, 198, 179, 231, 210, 215, 190, 212, 192, 145, 136, 185, 142, 184, 105, 198, 222, 168, 233, 178, 267, 175, 188, 166, 214, 158, 106, 197, 149, 159, 143, 184, 158, 165, 131, 209, 210, 172, 207, 180, 159, 192, 209, 208, 186, 212, 256, 218, 154, 147, 157, 192, 295, 169, 181, 220, 199, 190, 211, 169, 286, 166, 248, 142, 169, 115, 201, 180, 152, 204, 177, 161, 205, 175, 197, 212, 280, 168, 152, 170, 200, 151, 255, 147]
-7346A47R2j30L5M7K5Ko2N9k0J3l7J2j1N9p0O2k3j9P5oo5ln1J13n7M5k9n4K0L5O7k7J4n8k9
-7311A71J04r6L4m3J0J6p0K8oK9O1o8j0M6N6o1k0j6O2p0O5n8K8k9n1P3j2n1R6ql3m1kJ12m6
-7276B00j1qj8j8Q8m2m0O0K0m7pO6m2L2o6MQj8N5J0jn2k7j4J00r1J04l0l4k1K2K3k2JJ6q8
-7240A12L6J10r6J8j0L0l8rM%P1Pl5p2K3L9L6k1k0j3l2P0Pl3L1j9qM9p4J5R0n6K0n2K7r2L6
-7203A51P2o8K0rK5L1o7M5m3K0K8l7%M2J6p6J3k2J6Qk5O8o3M7n1J3J6J9K3m8O5k0J3k5j2l
-7167A82K7k6K3pK0Rm3nJ0k9k8LP7j2n0j4R2m6M8j1k0m7L1O0p8LK7j7kM1pk6l8Ol2O1k6P2
-7129B28k7O5m4j6lm1J0K4J7o0O0qj8k3L9n8N8j9j3n3J22n1Q4q0L3OKpl0J5P4j33J35j53Q3
-7094B18r1J02l3j1l7J11R2j64Ml9P9k2k8N7ro3R4j03N0N3j5m4j3OrL6m0oM1k5L4l2L0L5l8
$$ y = [147, 239, 109, 144, 191, 216, 218, 156, 215, 195, 208, 171, 183, 172, 231, 161, 223, 200, 181, 256, 250, 185, 182, 131, 244, 187, 232, 203, 149, 169, 204, 271, 244, 258, 200, 171, 275, 179, 213, 170, 180, 196, 126, 154, 148, 177, 238, 170, 160, 206, 262, 201, 181, 165, 227, 157, 222, 164, 192, 163, 112, 185, 173, 122, 218, 210, 177, 136, 134, 246, 200, 189, 181, 163, 145, 233, 191, 151, 211, 231, 184, 177, 243, 201, 233, 167, 171, 179, 161, 216, 226, 225, 173, 146, 132, 232, 141, 245, 215, 181, 160, 182, 205, 183, 184, 200, 112, 148, 258, 162, 180, 170, 200, 162, 153, 157, 157, 228, 235, 200, 128, 151, 190, 226, 205, 185, 172, 140, 210, 217, 184, 215, 196, 188, 237, 163, 178, 268, 212, 232, 180, 207, 115, 151, 223, 155, 175, 166, 191, 222, 155, 200, 157, 177, 205, 168, 168, 210, 226, 150, 163, 141, 157, 165, 140, 208, 145, 192, 141, 154, 170, 189, 212, 164, 229, 209, 222, 197, 185, 182, 209, 183, 206, 199, 219, 228, 185, 180, 190, 161, 133, 136, 213, 201, 151, 137, 229, 183, 231, 220, 200, 153, 184, 244, 166, 169, 196, 179, 177, 218, 211, 185, 147, 153, 121, 182, 156, 228, 201, 266, 222, 206, 203, 162, 172, 196, 213, 153, 213, 205, 187, 164, 203, 145, 203, 184, 171, 118, 240, 189, 273, 193, 226, 232, 234, 227, 197, 212, 286, 153, 288, 135, 218, 127, 229, 196, 185, 148, 259, 351, 187, 191, 152, 231, 209, 181, 238, 229, 166, 260, 157, 207, 260, 245, 201, 188, 194, 185, 221, 181, 175, 216, 191, 225, 193, 223, 258, 220]
-7059B20m1J04m7K7nj8j15P8j7n8J52r8M7o9L8P5n6k4n4nR2o0O8on3qN1M9m5m1N1J4o2MM3
-7024B31r3J8P4L0k7JK6j6q6M5om4R6m8M8n3K3o9M5K0JK5qm1K6rK5p7P%N2o2%M1L8n2j1L7
-6986B07K6k2LM6j39J40n1l2R4j8n5R0j9Npm9N3l5n3L4k4p4NM5K2M2qk3l1M5rK2l6k8J8JL0
-6949B15o8R1j3J1jL0j8l6l8K4Kk7M7L1r9L9J1n2P9m5M6Kp2Q0qp8J7O2ok3j6O7m1K7k2o0j5
-6912A43M9k6N7j8K8j6P3r7l3L5LMO9Qn8m4qj4J4k0N4pL7k5j9M3n8M6%m2p3N7l9J23r6Rj7
-6875A42J42n5n9R4o3O9j20N5K2p3P9m0K3K2m6N9m8l0j7L5Q3j39P5J0l9qL0l7M7m6k5N4k0
-6842A76P7m3on0K0k7PRJ6LM0K8n1J2j0p9Q1j1l7M6pk8J79j62j1L3P0q8L0j01R2L8j1q8M0
-6807A87L1J1j07M4m9kJ50n5L5o7l0L8L8k5K9k8J9Lo3L4J8K5oO1r7M7l4M4p1Q2j3M8J0n5n6
$$ y = [220, 179, 283, 236, 263, 258, 240, 125, 203, 186, 128, 280, 182, 229, 160, 198, 273, 217, 193, 139, 134, 226, 166, 234, 228, 175, 167, 218, 267, 222, 181, 232, 246, 184, 188, 231, 138, 156, 230, 260, 233, 234, 260, 244, 158, 203, 197, 153, 249, 201, 249, 196, 219, 150, 195, 215, 216, 241, 233, 192, 218, 209, 234, 157, 164, 164, 216, 154, 154, 195, 233, 181, 170, 207, 233, 211, 214, 260, 121, 261, 210, 178, 272, 254, 199, 289, 270, 275, 268, 219, 272, 237, 184, 218, 194, 120, 125, 170, 192, 234, 226, 203, 172, 217, 208, 230, 194, 166, 184, 185, 215, 147, 238, 225, 236, 235, 265, 247, 211, 173, 197, 199, 172, 219, 250, 151, 190, 201, 149, 228, 183, 229, 231, 159, 239, 231, 153, 170, 232, 226, 203, 187, 254, 213, 240, 218, 158, 143, 192, 166, 223, 205, 233, 217, 290, 193, 160, 195, 198, 202, 271, 279, 221, 177, 169, 155, 169, 149, 203, 196, 233, 208, 189, 232, 174, 220, 220, 178, 105, 162, 123, 246, 150, 159, 142, 284, 229, 170, 264, 201, 270, 150, 205, 227, 154, 233, 193, 216, 238, 192, 251, 203, 173, 156, 191, 274, 135, 210, 220, 181, 173, 203, 166, 213, 167, 142, 196, 176, 253, 210, 204, 154, 174, 147, 154, 163, 179, 182, 222, 250, 199, 211, 201, 122, 203, 192, 155, 201, 194, 166, 345, 183, 172, 205, 275, 187, 217, 116, 208, 246, 235, 147, 187, 218, 229, 122, 166, 117, 115, 265, 210, 245, 178, 148, 186, 224, 199, 228, 200, 219, 222, 159, 193, 211, 236, 230, 291, 194, 241, 207, 251, 180, 262, 249, 297, 307, 252, 196]
-6772A96M5m0L9k2oO4l6j1L4p1n0M5k9O4n2Q5p3O4Pr5K3J9o3J20n3k5M1RQj2Nj9M3pj7jp5
-6735A54Q5k6p6P0N1l5O1k5k8Q9n0K3l0k3n4M0o5J1Q1j1k1l8JR5k7%k1O2j23J03n0M7M0r7
-6701B13P0r9l2Q5L7K0o0J01n7J6M5o1R9m0j19O9L3j6Lo6oM4J2jo1Q0P8j63J14PM7n9J49m6
-6667D36M7PL7P4R8J42J42J33M1P9j00j21j89p8p6q8p0m5nl1p6k1M0m4N9j32M1LJ2l1M3K3
-6635C50r5M8M8K0o1k9N8m2n6P7l0K5J8n6L7j31Q5j0L3j1ML2J4j4n4N5m6J3k3M0l4L2r3J07
-6601C11j01K0JL2n0P0Rr8J37j42L1Oj2L9O1j44L8mJ05o5K9k2j3J0Mm2R4o8jo3N3L3Jn0O0
-6566B69o6Q4q9o5J24P2o0j4j8N7k1m5oL4j3k8l4K0P2j1r8J5O1l6j5L9JJ0M4L7j21N0j3n0
-6532A86J4jK4K1m5m4J12l7kj9J1j6L0K4q8O8J5n6P6r2J4M2n0L7j9K9qm2R6p0ORk2Q4r0j5
$$ y = [196, 241, 201, 240, 218, 212, 276, 240, 229, 263, 192, 142, 187, 158, 222, 170, 255, 182, 246, 253, 158, 181, 200, 137, 257, 204, 179, 220, 229, 237, 225, 230, 211, 254, 247, 230, 229, 154, 239, 213, 137, 207, 258, 223, 284, 259, 231, 320, 270, 293, 263, 240, 186, 226, 161, 172, 253, 242, 221, 183, 184, 279, 252, 252, 231, 293, 170, 273, 223, 270, 310, 213, 283, 184, 152, 237, 274, 294, 234, 335, 278, 294, 339, 278, 377, 337, 218, 287, 320, 304, 307, 241, 235, 279, 291, 290, 229, 309, 387, 224, 338, 345, 392, 333, 482, 436, 483, 490, 527, 601, 699, 841, 983, 1116, 1157, 1236, 1136, 1015, 826, 748, 672, 584, 514, 469, 464, 433, 357, 336, 376, 332, 391, 259, 300, 303, 315, 284, 327, 350, 255, 303, 351, 371, 310, 281, 339, 297, 241, 318, 288, 313, 331, 275, 312, 181, 266, 256, 289, 278, 282, 314, 328, 314, 260, 315, 269, 282, 259, 299, 265, 297, 204, 311, 210, 230, 231, 263, 213, 283, 292, 194, 331, 189, 220, 226, 214, 253, 314, 170, 208, 204, 309, 244, 273, 251, 238, 248, 252, 210, 304, 236, 235, 172, 225, 258, 259, 209, 269, 203, 287, 198, 133, 257, 329, 269, 255, 237, 294, 273, 228, 222, 256, 243, 215, 181, 201, 273, 262, 164, 179, 240, 204, 189, 228, 229, 239, 283, 320, 199, 249, 236, 186, 200, 199, 223, 244, 199, 155, 267, 230, 228, 209, 220, 204, 234, 258, 170, 238, 253, 197, 273, 181, 195, 237, 187, 224, 205, 234, 226, 184, 280, 210, 216, 225, 203, 287, 197, 182]
-6496A82L1M8o4k0K4K4olK8O2r3QJ3K3j18M2K4N5o1j2P3r9M1L5n0m6P8m0L0p8O4K5l8Ok1j4
-6460A53O7l9j0M7L3L5j18Q2n4K4k5P2n6k3J0j5l3J02k3l5pJ8Mn6rj2P6l5N7k3Q5n3p4Q1n4
-6425A92Q9n8J6j3M7p9N1L5m3kL1Lj26K6k7N7o1O5RK1pk6M5mp5N4J7pPO7j24PL8N6k9J5p1
-6388A96L4l2n2N1N7p5J8j2J30j11RRJ6Pj34Q8K0m6JO1qj7j9L2M6n0K3k6M2p0j7J00n8N1r2
-6353A72L3N1k3j8m6oO0L4m3p7P2nnj4M3j6Lnj4P9j03L3pL6k9L9J4J3J1o5N6q6l5R0K7l8o0
-6316A71P9q7J5L9k0K1m3NOO5l5L0l3k4P5Rr9J36j01m3J6K2m3L4qM6k0K4J5k5M4p5k4k7J50
-6281B95r4M3p7K2j4M6P6n3l3M0o0j5L1n0J08j25P4K0p7P3N7o0o6lJ6Q3o8P9p4K5K2n7K0n0
-6247A54K5L2j3M1K3J7j10P4o9P4l3k2K4l3O2l1M2k0p6J16K5o4k0k9m8Q6m1J14j31j4M0K1
$$ y = [182, 213, 261, 197, 177, 201, 225, 219, 216, 244, 306, 213, 221, 234, 257, 139, 181, 205, 260, 199, 187, 260, 161, 202, 237, 187, 141, 219, 179, 209, 131, 195, 220, 182, 188, 167, 153, 220, 181, 171, 218, 251, 286, 168, 250, 196, 220, 195, 267, 211, 188, 198, 183, 150, 252, 229, 194, 187, 205, 209, 153, 144, 132, 208, 173, 230, 207, 292, 239, 165, 246, 192, 281, 223, 239, 226, 273, 194, 245, 280, 237, 235, 266, 269, 143, 169, 142, 199, 138, 203, 212, 233, 226, 200, 245, 241, 166, 220, 237, 230, 237, 304, 180, 187, 225, 281, 252, 267, 196, 230, 198, 146, 197, 254, 179, 197, 185, 315, 204, 213, 222, 238, 245, 111, 199, 219, 173, 174, 235, 227, 210, 191, 223, 269, 219, 242, 216, 258, 188, 171, 271, 213, 264, 172, 205, 256, 233, 215, 169, 163, 223, 257, 214, 137, 209, 204, 199, 185, 228, 212, 215, 210, 196, 275, 172, 205, 198, 234, 205, 244, 258, 271, 282, 217, 273, 187, 152, 242, 269, 231, 171, 250, 163, 178, 217, 197, 218, 175, 180, 186, 251, 216, 246, 213, 189, 264, 273, 174, 310, 209, 166, 182, 204, 161, 195, 187, 233, 213, 237, 252, 227, 271, 196, 172, 145, 295, 201, 244, 167, 189, 175, 221, 297, 244, 211, 251, 191, 176, 207, 157, 265, 140, 214, 234, 157, 230, 287, 227, 161, 158, 174, 257, 189, 268, 194, 219, 241, 184, 204, 154, 179, 211, 198, 239, 262, 279, 169, 243, 174, 248, 215, 193, 217, 184, 246, 215, 257, 237, 161, 277, 302, 238, 218, 189, 141, 227, 186, 300, 169, 155, 195, 216]
-6215B16K4j9M0k2%k1K9n6K3J03j47O6l0n1J6J8N5J0o9M7O7q0O2n0l5K0l9O5k7K8KMjj9k4
-6180B05O6j3k1l7O0j06j2J24p0m0J09j9J8o5L4K5o1P6p8p1J16j7m1M9j6k4L6m0K2M9r1N6
-6148B23N4n3q0P2O8m5j5K1j2K9k2M7Kj41O5k3l1J14q6N0K4K9o2m8N6Km9K9l0O7J8Jj02L7
-6114B09Km2Q5K2J9n9p0K1Q1l7p5J29j74J34o2Q8q7O4j7j1k1N3p4J24Jj42Q1JjrP4m8m2K1
-6080B38k5k3K2m6K3M5m4M1q0P8k0P7j11R9j7k6pj2M3j7L3j18R6k5n3N8n2M8M3o1j1M0J9L0
-6046B85p9L7k3L4K0o5P1j07RQ0j7MK3o8Mm8J02m1K0%q0N0KoP5l7k2n7R1J6%m5J1l1K0o6R3
-6009B55RM1J3r9l4O5l0L8L8m5j6j0M1n6lm5J15p4M2Ml5m7R9m3k8L0m0O0M5r8k4MR4k9j3r
-5973B15n2R5m2K3P4r6l1M1K1L4n5L5l6J3j1J4l8N0r3N4O4o4J3J0PJ5l1l8P2J3k7mo1N3Oj3
$$ y = [216, 240, 221, 261, 239, 239, 218, 247, 191, 214, 317, 170, 236, 206, 155, 171, 189, 244, 254, 185, 232, 299, 219, 281, 231, 196, 216, 177, 242, 215, 243, 245, 249, 248, 229, 205, 271, 258, 237, 200, 260, 154, 142, 266, 196, 156, 265, 246, 264, 199, 233, 258, 197, 273, 195, 124, 240, 223, 182, 231, 215, 191, 227, 187, 209, 258, 167, 223, 277, 224, 144, 216, 284, 239, 224, 245, 233, 262, 240, 287, 289, 148, 213, 190, 159, 273, 187, 237, 261, 290, 228, 180, 236, 238, 189, 218, 188, 255, 273, 274, 172, 209, 211, 169, 254, 276, 295, 236, 166, 187, 268, 231, 156, 285, 111, 245, 183, 271, 184, 248, 231, 220, 199, 252, 178, 302, 303, 161, 242, 243, 242, 233, 307, 259, 217, 238, 213, 190, 212, 166, 189, 234, 190, 231, 151, 229, 209, 286, 175, 274, 257, 231, 224, 212, 255, 238, 271, 153, 249, 224, 171, 229, 177, 225, 268, 207, 196, 236, 255, 285, 206, 243, 220, 254, 274, 209, 280, 173, 182, 262, 245, 249, 272, 204, 208, 160, 262, 221, 241, 241, 161, 211, 213, 207, 282, 245, 223, 166, 257, 273, 273, 228, 239, 208, 228, 162, 255, 264, 305, 318, 219, 185, 250, 220, 258, 296, 251, 235, 225, 266, 210, 207, 162, 277, 203, 245, 249, 214, 167, 266, 223, 195, 225, 185, 245, 290, 192, 168, 172, 266, 237, 224, 215, 163, 258, 216, 239, 313, 217, 186, 227, 248, 282, 227, 262, 226, 239, 228, 242, 204, 254, 161, 215, 279, 215, 228, 238, 245, 260, 229, 191, 263, 276, 249, 245, 184, 237, 243, 230]
-5937B30mJ7J5Qj06O6MK3L2l9p5J46r1kK5K0k1o0N5k5J6m7N3j4o8O5M0K3p5J7J5j7l8Q7m6
-5902B29M3k1n3M9n8O3NkJ4o9M9n0K8nKj13J07j8J1P7j26O7pM4l1l1L9J8J3k3Kl7m3J34o9
-5867B38M1m5J5k2J7K1m2k9M1k7N3j7mq1J42n1N%n1J03k5j23J00j1l6O5l9L3n9K1j3j4J9O2
-5833B87%j04K8L5O4q0K8KJ3o4J5J1K4K0j11N0L6n3P5M3j32J14n4j9qj1O1J3q3JM5n0lN1o
-5798B38P9q9J4M9n8j8JO3n8J41j36Q2mj0l1n5K9o3O0J9j8o4J29Rn3p9J12J6k6l0L8J8m7m7
-5764B11j4J6o5Q5L6K5n1lJ3N7l3k6K4k4K4O5r2K7M5k2p2L6K1K0k9J2l2m7O3N%O0j41J06k4
-5729B76j2R8j50RM7k0O4k4n7Q2Kk2M1o3J2j2k9n1N2oK3%mk0N9l6jm6K1L1qK8pP7o5j04Q0
-5692B65nl2N9j3k4j2J3LQLj5qP9j1n7j1l4qJ37p0J4n9M1jQ4j31Q2l9mj4M4N8j03j9P9o4Q4
$$ y = [230, 226, 243, 258, 266, 160, 226, 230, 253, 285, 246, 171, 317, 226, 224, 249, 269, 248, 188, 243, 218, 234, 187, 240, 226, 158, 223, 263, 286, 211, 228, 243, 226, 188, 275, 229, 272, 251, 198, 247, 189, 252, 257, 255, 269, 200, 249, 199, 227, 222, 224, 111, 218, 200, 211, 288, 162, 229, 222, 266, 235, 204, 243, 261, 274, 251, 253, 216, 173, 307, 238, 279, 234, 249, 227, 244, 265, 223, 194, 235, 208, 261, 244, 240, 159, 301, 250, 255, 255, 204, 307, 282, 159, 259, 248, 212, 277, 238, 271, 212, 233, 220, 206, 225, 287, 287, 183, 211, 246, 310, 230, 258, 260, 273, 209, 224, 235, 259, 279, 168, 218, 254, 201, 276, 319, 187, 301, 247, 228, 220, 209, 270, 283, 200, 201, 246, 196, 193, 244, 238, 317, 228, 242, 291, 233, 215, 216, 279, 221, 362, 226, 308, 304, 294, 263, 208, 237, 174, 234, 253, 235, 171, 300, 309, 256, 177, 289, 305, 279, 249, 287, 305, 258, 211, 197, 213, 148, 233, 269, 294, 243, 240, 253, 310, 277, 251, 275, 251, 275, 340, 248, 275, 320, 298, 226, 262, 283, 303, 274, 286, 254, 207, 270, 275, 275, 335, 194, 300, 276, 264, 362, 212, 221, 268, 248, 312, 288, 231, 313, 315, 293, 334, 271, 283, 271, 242, 191, 243, 237, 260, 260, 256, 236, 295, 259, 258, 212, 233, 264, 256, 284, 277, 354, 289, 185, 265, 260, 228, 287, 274, 250, 238, 251, 254, 262, 265, 250, 242, 321, 310, 253, 242, 208, 200, 337, 267, 281, 222, 263, 262, 346, 215, 297, 258, 254, 240, 284, 342, 239, 220, 299, 235, 319]
-5655C19j8l9nk3J16m4r3J02k1l1N4l6J3Lm8M0J4l2RJ3l9R3j32N3jM5Oo3oJ2N6j0pl4j4K9
-5619B81q8J03Q0j07O1n6Kn1O4q4L2M7m7O3r3P2K5p2M7m6M4k1L1k7P4o7nL6J3n4L4l%nK1J6
-5583C20p1P1Jno4P3J8m4m8N7oj5M1l0rL4lk9m4j6M7K6o7O8m7pL4P3o6M3l3L9p1Q3Mo4k1J5
-5545B87k4J7jM2r4Q9j4L7l1o9J29o6o9J20j9j5j4m1j5N0L0mk9J5M4Lj21J46r2J9nQ0o4r2
-5511B29J58o5p0O3J3n0L6LN5p8J9L0o4l4O4JN3k3m9L1J17r0K3l8k8J4P5p1m5N8J8qj1j28
-5477B08J99l1k6l2J7L0mn0o8M3JM1J1k6L0K7k7l2J8L9L5p7rL1m2L0J4l1N1k2j3J1J9O0n4
-5442C71kJ1j08L7L6L0j7pj7N1M2p2K1ln1K6LkP5p1M0N8q1l5Rl3L7L5j0m0J5j4m9L1P7JK4
-5405D18j9k4j6J0l1K1j2J3J0o3J4L2M7m4N6l6o4N9p3Q3M4k3o7K2m0M7jM4Rr3Q9j05P0%M5
$$ y = [319, 301, 262, 257, 234, 350, 306, 213, 315, 294, 263, 317, 281, 294, 297, 249, 289, 303, 271, 280, 293, 254, 347, 215, 268, 267, 312, 318, 255, 249, 261, 317, 307, 300, 266, 252, 281, 193, 296, 376, 269, 330, 274, 276, 225, 289, 205, 237, 284, 237, 300, 207, 279, 304, 232, 279, 233, 277, 256, 287, 260, 334, 267, 262, 298, 311, 257, 291, 288, 288, 283, 304, 320, 249, 320, 321, 316, 252, 325, 343, 299, 251, 308, 302, 287, 328, 298, 289, 323, 320, 291, 247, 231, 278, 304, 237, 305, 258, 251, 285, 358, 292, 335, 302, 341, 270, 353, 357, 293, 272, 287, 263, 280, 279, 321, 227, 316, 302, 339, 308, 239, 368, 302, 233, 353, 334, 319, 305, 264, 249, 299, 329, 325, 296, 311, 355, 358, 237, 383, 291, 310, 305, 385, 321, 229, 387, 322, 252, 315, 328, 278, 314, 317, 372, 294, 313, 343, 279, 245, 309, 310, 363, 340, 291, 322, 439, 349, 372, 334, 306, 320, 395, 324, 279, 337, 355, 347, 336, 208, 407, 376, 350, 318, 335, 365, 361, 311, 243, 286, 287, 328, 339, 313, 343, 370, 343, 311, 329, 368, 403, 326, 317, 348, 306, 336, 350, 319, 370, 348, 335, 346, 365, 425, 371, 369, 380, 272, 309, 345, 375, 358, 351, 334, 385, 427, 355, 376, 373, 322, 348, 351, 349, 424, 353, 393, 451, 370, 335, 344, 311, 348, 383, 373, 333, 348, 334, 285, 316, 393, 394, 418, 399, 375, 359, 369, 338, 359, 347, 360, 370, 307, 321, 353, 400, 356, 412, 376, 312, 371, 298, 381, 425, 402, 335, 357, 317, 364, 363, 407, 416, 323, 412, 307, 377, 377, 422]
-5370D22Nj22J05K8o3O5m9M5k8k4m9J36m2Jn1J1n5qP1M0j7m4L7mL4l7M5po2K7o5N8mO9l4m0
-5334C94nL0%N7J0n4p0K6J44j80P6l7N7k7K5K9m9L5m8R4n9OJ3M6k3J7l5k7J2O1l4Jj6l2M2
-5299D79L5q2K5j1oK9K8m9m7J56j1m5n5J18l8M6o5K4n0NM7o1K1J8l5M6k2PQ7j22O2Mpj9K9
-5264E41K5k8m4O4m7K7k7O4Rm3l9N3pN9k1j3q1J52p4K5l0N4l9L1K6o5KK3R6j08J6L0L3pj5
-5229F42L5nj5oL9mKN3j46P9J6N5J9n7L1krjJ5K3p1J19Nj3Pp3R4nlLm1N4nL5j09Q7kl1J19
-5190I34j17J66j28R9K2m2RL4L4k7K2k9O4k9j1O0P3j9m0P6N3l6M9P0j22M5P2k9N0O4QRM3j
-5156A426M3Q4l9K5P4N5J6L0J11P9K1j3J25o7J28P3Q4O5j2Q6K2J29J78n7J30J78K7R6J17J12
-5126C326J49J79Q8J82J07K09K44K22J94K62K21K50L44L75L12M83L64N32L96M63N66O03O58
$$ y = [422, 427, 305, 410, 438, 375, 440, 391, 436, 408, 384, 335, 471, 429, 430, 379, 390, 335, 327, 398, 438, 421, 377, 414, 410, 444, 407, 452, 445, 383, 410, 345, 403, 399, 468, 434, 394, 389, 419, 419, 476, 486, 432, 362, 388, 532, 352, 428, 391, 448, 421, 446, 475, 426, 461, 413, 507, 448, 454, 467, 513, 490, 507, 472, 445, 457, 518, 484, 485, 469, 437, 479, 514, 432, 457, 446, 440, 469, 497, 448, 401, 557, 546, 501, 446, 564, 526, 572, 507, 531, 481, 486, 533, 472, 493, 511, 476, 522, 500, 507, 594, 472, 534, 538, 531, 512, 541, 566, 538, 494, 558, 511, 538, 511, 575, 584, 541, 502, 555, 548, 607, 586, 573, 492, 644, 570, 595, 565, 619, 580, 611, 637, 572, 574, 597, 693, 585, 601, 631, 664, 657, 642, 677, 672, 657, 651, 690, 686, 688, 741, 595, 674, 690, 745, 764, 707, 738, 736, 727, 726, 741, 764, 693, 812, 817, 804, 811, 738, 832, 827, 824, 827, 786, 840, 835, 870, 761, 848, 846, 815, 934, 817, 983, 855, 954, 976, 934, 943, 977, 1011, 984, 1006, 977, 1041, 1012, 1001, 1061, 1134, 1115, 1075, 1151, 1204, 1168, 1217, 1287, 1165, 1210, 1282, 1253, 1303, 1367, 1375, 1384, 1427, 1426, 1469, 1553, 1514, 1539, 1613, 1668, 1684, 1714, 1825, 1904, 1925, 1912, 2037, 1970, 2098, 2171, 2255, 2320, 2308, 2394, 2416, 2545, 2723, 2666, 2796, 2974, 3001, 3097, 3214, 3326, 3475, 3654, 3742, 3924, 4031, 4240, 4484, 4706, 4900, 5162, 5383, 5633, 5977, 6352, 6664, 7147, 7511, 8043, 8439, 8902, 9468, 10071, 10729]
-5103A0729P08P01P20P11P87Q61O72O79P29M30M86M01J32m5j15l00m08n23o04n98p51p33p14
-5080A3955p51p68p19o63n54o12o08m55n02n01m53l96l22m40j44m38k27k43k58l12q2k61j59
-5057D087j82k17j19j40j54j30j39j21r6j14n0l6j05p6o8j20j02kj00k3p9o5Pm4j37L0p6j9
-5029A610j7j25l7k1qL0j7p8j0q5R8q3p2M0l8j4nk0j0j29L4l3K8J15j47J8o5J0J3q0ko3N6
-4996H93J2n3rJ9n3OQo7Q2k8j8k7Q3Jr9J9k3k2J5k0j2RPK2m2L5j13L0O0p1P8r0%K6l1N6m1
-4959F42nK8J6K8j65P8lN0r5L6q7J13mL3j48Q4L0j0Mo3M3ok6N9k5l5p2K5MmP2n5k0L6j8j5
-4923E25Kj3L5l3M3j05J33m3Pl2P4m2o3K8l1L7P6q2J8l8m6N7oO9p0k9K8N0j1k1m7pM3l3r3
-4888C80N5L2N2q5J19n4MOn7N0m1j8K6j9J8L9o5j0nj5l5O8opo1J5J1J6j4L4J1q4M6K5jRmj01
$$ y = [10729, 11437, 12138, 12858, 13569, 14356, 15217, 15889, 16568, 17297, 17727, 18213, 18614, 18746, 18701, 18586, 18286, 17878, 17355, 16751, 16153, 15402, 14669, 13955, 13204, 12436, 11717, 11054, 10500, 9888, 9280, 8825, 8323, 7822, 7369, 6973, 6651, 6211, 6067, 5629, 5402, 5159, 4901, 4589, 4507, 4246, 4087, 3905, 3688, 3569, 3429, 3275, 3145, 3006, 2885, 2789, 2675, 2625, 2589, 2484, 2408, 2340, 2220, 2118, 2116, 2016, 1993, 1914, 1849, 1856, 1812, 1675, 1705, 1629, 1610, 1593, 1468, 1431, 1410, 1402, 1432, 1415, 1337, 1327, 1242, 1340, 1257, 1185, 1225, 1187, 1173, 1168, 1148, 1138, 1009, 1043, 1010, 1038, 1153, 1006, 1024, 959, 969, 982, 902, 900, 837, 893, 905, 852, 843, 862, 809, 815, 823, 756, 838, 810, 792, 765, 848, 849, 750, 769, 746, 724, 739, 719, 707, 716, 723, 745, 703, 738, 625, 655, 715, 644, 722, 632, 632, 658, 627, 683, 642, 637, 665, 681, 709, 544, 622, 619, 669, 574, 610, 523, 636, 632, 665, 517, 601, 631, 621, 625, 562, 605, 599, 573, 632, 607, 572, 500, 525, 529, 525, 597, 542, 522, 558, 540, 525, 527, 514, 549, 516, 559, 454, 587, 544, 551, 519, 593, 551, 488, 516, 485, 522, 598, 516, 534, 496, 450, 507, 501, 570, 500, 471, 499, 549, 538, 517, 470, 463, 506, 473, 380, 435, 467, 519, 434, 553, 499, 503, 509, 452, 502, 461, 443, 469, 450, 468, 507, 442, 432, 427, 412, 377, 445, 439, 432, 371, 386, 397, 413, 399, 433, 444, 360, 406, 431, 430, 439, 435, 334]
-4850C34J04J5k3o4Q9j3m9J2Ol4J2O0m3o5j1K4Q5j68L5Q1m2N6j7m6N6M4n3m1L2k0j4pP0o7
-4816C38L0K7j18P4o2K4J6k9J14j39K0PK0J2j8J6q4K0oK3L0NMN8mk8r3Q6KJ6m1O7l4q4K3l9
-4780B53M8L5o0L1j0j9k7Q8r0M1PRm4RP4oLk8l9J00m0q0L9j0L9o2Q1q3M3k7J00p9m6N6j5Q
-4744B99m4O0l6P6r7j3N2K2m6kK3K2r3R3mq5R0j7Kk9MP4n6k0m4L9O3q0l0O3j7M0p8K0L2K6
-4708C09j8Rl0N4m6M8J2n7n8L5PrQJ2k2P0oN0j20K2L3MLl8L9o9P8n2L8m5O6q1oL4l2m1J34
-4671C35q3Q5k7K2n3RM5q1J4k6JN5p0J22k1J0n5o0L0NK1o3J02J1l8nj8M5o3M1K5nK0N0p5q1
-4635B24Q6k9j4k1L9R4j29K9M3m8l2Q3j10J14n3j2O6r5M9o7J28j13M2L6o3ML0k1K0LM2n5N1
-4602C21p9OK5M5m7L3m0J14j09O6l1L1J3j33J20o3L9r5R4J0q9P4%M0o3N4l4o1K5P2m7o1N0
$$ y = [334, 438, 453, 430, 366, 455, 442, 393, 405, 411, 377, 389, 449, 406, 341, 330, 354, 439, 271, 306, 387, 345, 401, 384, 338, 394, 438, 385, 344, 376, 356, 342, 335, 405, 338, 368, 395, 277, 351, 289, 313, 329, 300, 414, 275, 295, 302, 322, 334, 316, 332, 248, 268, 262, 285, 315, 320, 324, 382, 378, 350, 257, 343, 345, 361, 320, 387, 353, 269, 292, 253, 301, 336, 276, 307, 297, 278, 251, 339, 249, 290, 297, 306, 262, 271, 345, 339, 342, 314, 275, 375, 335, 255, 294, 284, 323, 261, 342, 259, 302, 275, 375, 296, 250, 306, 291, 299, 255, 315, 279, 355, 258, 245, 297, 319, 273, 271, 294, 316, 223, 316, 312, 227, 317, 300, 302, 273, 277, 351, 295, 275, 231, 270, 333, 253, 223, 286, 269, 309, 231, 251, 283, 309, 291, 300, 270, 324, 278, 326, 338, 281, 223, 258, 265, 256, 264, 276, 254, 324, 318, 368, 248, 270, 303, 307, 310, 272, 311, 242, 320, 268, 306, 261, 327, 246, 240, 274, 242, 201, 335, 252, 337, 310, 332, 279, 288, 333, 252, 266, 240, 241, 296, 226, 348, 327, 337, 282, 222, 252, 257, 278, 215, 317, 328, 290, 285, 267, 312, 249, 290, 315, 310, 330, 380, 305, 224, 310, 281, 267, 246, 285, 379, 250, 279, 322, 274, 242, 325, 215, 329, 276, 264, 330, 235, 284, 217, 345, 232, 274, 310, 247, 251, 281, 260, 280, 283, 325, 270, 321, 242, 248, 273, 318, 271, 304, 264, 378, 269, 335, 304, 335, 348, 215, 335, 272, 311, 216, 310, 320, 231, 305, 305, 345, 282, 336, 302, 241, 266, 338, 291, 230, 280]
-4569B80j7M0q8P9m8k4M1n7J90j17l8KN1l5M6l6M8r1M5RK3J2n0M1l8K7L0l2%n1K6j8N7k1l9
-4534B47J6k7M4l5J5M5O6n2N6j12MJ3L5J0n0L6J4q7K1j0R1k8l9pK5k7k9oPJ9RL2K6o7PpJQ
-4496B64J5Kj3M6l0k8N7l6Q8m3m5j5L1O6j55P7l6j0Q4k2o4M7m3K9n5L4M8J3J1l2RNO1n0J0
-4461C20l2o9Q3nP4j28Q2j4l0jn6N6M0l0J0Rj3j3N2n5J9K4P8p2q1P7k2K6o1M7p4LR6J7j19
-4426B38J25o0M1J03j42N5p5J1L3j6k6J6nO6j59P6l0O9Pn1k9K3O1K3j7j09O6N4l1n2P5m3P8
-4393C75m3J8K9m1N9q0j0R6p4No3J02r0N0pk9Q3k3J4o4L6J4K2j4k7nPQ7o0rl5L0J2m0N2L3
-4357D10l5j7J9m6J07n3R7l5l5J8kj9l6L5K2m5J8l7O6o1pN7J2jr7Q0l7K8j5J3J9o5n0P8K2
-4322D08m3R2n7J3pQ9o4j0m5M5j7K8L1m0K1o3m3J02N2j7k7k2J9k6L8Oj7N8O4m1J07K1Lj01
$$ y = [280, 263, 303, 215, 294, 246, 222, 263, 206, 396, 279, 241, 243, 294, 259, 305, 269, 317, 226, 271, 280, 303, 315, 265, 306, 268, 295, 325, 293, 293, 242, 268, 250, 307, 286, 247, 263, 236, 280, 245, 260, 305, 371, 319, 375, 263, 267, 280, 315, 325, 275, 311, 325, 238, 259, 249, 340, 312, 273, 266, 291, 264, 235, 229, 236, 255, 264, 296, 322, 255, 262, 255, 256, 264, 279, 281, 268, 314, 284, 256, 313, 277, 365, 322, 277, 262, 293, 359, 204, 281, 245, 235, 319, 297, 233, 280, 237, 266, 211, 245, 293, 306, 317, 285, 294, 299, 360, 310, 320, 288, 219, 302, 297, 371, 243, 325, 311, 281, 280, 224, 280, 320, 290, 300, 309, 296, 283, 335, 280, 299, 323, 401, 329, 248, 325, 303, 329, 268, 315, 241, 244, 340, 357, 238, 363, 303, 344, 447, 305, 360, 285, 296, 329, 313, 287, 303, 298, 364, 205, 281, 251, 320, 327, 276, 247, 270, 331, 354, 337, 228, 294, 348, 317, 265, 340, 297, 375, 332, 350, 379, 338, 397, 317, 307, 403, 329, 334, 271, 373, 283, 333, 326, 297, 380, 357, 371, 307, 343, 357, 379, 365, 338, 333, 340, 427, 367, 358, 323, 353, 365, 325, 377, 410, 375, 358, 377, 331, 438, 385, 482, 447, 412, 430, 428, 409, 373, 408, 430, 385, 403, 366, 432, 371, 364, 421, 433, 432, 335, 415, 378, 406, 391, 404, 423, 358, 308, 386, 408, 365, 457, 400, 413, 406, 495, 431, 421, 376, 421, 404, 432, 463, 423, 444, 381, 338, 440, 492, 475, 448, 426, 445, 419, 457, 463, 446, 504, 568, 527, 634, 655, 658, 557]
-4288E57o6qL5K1k5k4m0N4M5q6jL2Q3p3OR1m8o3M8j3m7O5j0L4K2l9p5J14n1J0k5N1lM6r7j3
-4252E07J17n9L1m0K3M2o2l1J08j36R8k7M0j6K8J5oNM6p6Q3mnr4k4L5J07o4M7r5L5J7oj3M6
-4217F72M4j9J3K6j5J8M1p2K0J6kj40J84l4JMO1q2l3R6j5Lj5L7jJ6L0oL2q1QP9l9J1K2m1Q7
-4180I26L0l2n5N6N0Nqj0LM4Nl4N0j9J11n4M3q5J39Rm6K8K5L7j2K7L7nP3P3m6L7K0L9K7j8
-4144A470N1R7j4Q3j1J69k8JJ18P8K31J00J24K90K66L96J43j34j84j5k3N6K08O7J06K06L27
-4117D178Q8J90M03L33J84L73L24M36M02M05M57N36N15M85M90M67K13K4l04m55o21o47n78
-4094G898n23m76m90l00l53l22l52l16l88k46j89l52k24q4k48j23r7r2n3J43O2L72M98K23
-4070C968k68o96o38k59k36j33j24p1j49Ojj51L9n0n4p3L8p2j1pK6o1M1j0r6n7N9l0Lm5m2
$$ y = [557, 491, 483, 518, 539, 514, 490, 450, 504, 549, 463, 462, 494, 577, 504, 510, 601, 553, 490, 538, 525, 478, 543, 533, 567, 589, 550, 475, 589, 538, 548, 523, 574, 571, 617, 520, 507, 624, 565, 596, 556, 579, 621, 559, 528, 636, 500, 598, 571, 611, 595, 623, 638, 632, 637, 683, 607, 690, 686, 681, 587, 563, 598, 705, 641, 688, 593, 628, 645, 639, 626, 672, 716, 697, 710, 736, 721, 739, 780, 708, 728, 744, 742, 602, 786, 752, 753, 757, 818, 736, 703, 799, 784, 787, 772, 809, 808, 824, 854, 848, 880, 799, 807, 886, 847, 858, 880, 839, 926, 956, 924, 869, 925, 975, 980, 972, 962, 965, 1009, 1014, 980, 1030, 1011, 1122, 1068, 1111, 1026, 1165, 1174, 1128, 1156, 1181, 1218, 1206, 1233, 1270, 1265, 1338, 1411, 1365, 1402, 1422, 1461, 1488, 1470, 1521, 1618, 1604, 1687, 1676, 1845, 1817, 1818, 1936, 2014, 2245, 2345, 2469, 2759, 3025, 3421, 3564, 3430, 3246, 3231, 3208, 3264, 3472, 3539, 3645, 3851, 4178, 4266, 4456, 4859, 5192, 5376, 5749, 6073, 6509, 6911, 7316, 7773, 8309, 8824, 9309, 9799, 10266, 10479, 10503, 10199, 9744, 9123, 8476, 7898, 7375, 6899, 6409, 6109, 5756, 5434, 5082, 4766, 4378, 4132, 3943, 3591, 3367, 3283, 3035, 2912, 2815, 2723, 2670, 2813, 2875, 3247, 3745, 3968, 3700, 3004, 2366, 2107, 1871, 1738, 1614, 1543, 1394, 1400, 1399, 1248, 1287, 1237, 1183, 1110, 1148, 1076, 1065, 1058, 1084, 1023, 1064, 1054, 958, 901, 960, 930, 933, 888, 846]
-4039H46P6M8o7oL6q8%lN2j8L7Mq9J4RN7l9J0M4L1rJ30L8K12K99K04J0k47k81k29r1p7n4j5
-4005H44K6n9PJ6K6m6o3L3M5Lp6nK0k2m4L9M7l4j01J23j7n6O6j8p2P5j5j3k1j3N0j7mN4r9
-3970F79K3j4R2p5r3J14Qn3m4J3L3J9oK6p9P2m8Qo7lK4l0K1m6O0M0n1k8l5K5L4k7j6k6k4N2
-3934E78o5J1JL8Qo2J4j8L2J9o5j9MqN1l1n1l9P6P2j01M2M6j05O0k8nq4J11j5Oj5K1k8L0K
-3898D83o0m6RJ24j42L3j8J4n0J07n3mj7K1l2l2J10Jo1m9m4R4J8k7jO7l1O4n6K1j0q8L6P8
-3864D59q5K7k1Kpm2K3k0Lm6PO1Nkj0m3P8j20O4Q8j20pJ0l2l3J45n4K8k5J9l1Rj6L8J2j37
-3828B27J08qj1l0K8q7J18j06LJ06r8k5N7J11j05N5L5p3J5pK0o3J09m8j2m2L9q8N7k9l4Q7
-3796C09n7N3p5N6l8M4jN8Ln2n3J2j8PL1l7J2M6q6O6km8N4l7L5j0j7J2p4O6J8RLp8J28n9n1
$$ y = [846, 922, 970, 903, 897, 933, 845, 845, 842, 894, 876, 913, 917, 828, 842, 851, 908, 869, 879, 923, 954, 945, 1075, 1113, 1325, 1624, 1828, 1838, 1591, 1310, 1081, 990, 913, 859, 844, 870, 811, 818, 834, 860, 814, 751, 784, 829, 832, 756, 751, 771, 749, 705, 744, 791, 757, 656, 779, 762, 706, 772, 754, 682, 757, 742, 729, 708, 695, 745, 728, 724, 778, 679, 702, 688, 780, 705, 612, 726, 734, 681, 637, 650, 683, 702, 696, 722, 643, 715, 667, 675, 608, 605, 629, 599, 620, 574, 634, 674, 623, 595, 560, 585, 619, 592, 576, 550, 526, 578, 513, 524, 525, 563, 571, 509, 523, 505, 537, 556, 491, 472, 476, 468, 519, 488, 437, 398, 474, 546, 445, 487, 533, 428, 488, 460, 455, 371, 482, 467, 473, 458, 479, 451, 481, 483, 423, 377, 386, 510, 368, 401, 383, 397, 347, 454, 401, 397, 380, 401, 369, 337, 447, 448, 387, 338, 294, 388, 406, 379, 378, 445, 414, 478, 422, 443, 433, 345, 381, 459, 374, 401, 380, 382, 375, 333, 356, 336, 339, 293, 300, 361, 366, 364, 354, 311, 389, 269, 333, 421, 301, 294, 304, 272, 239, 384, 330, 358, 333, 352, 321, 330, 314, 352, 364, 227, 335, 327, 316, 286, 314, 227, 345, 239, 242, 348, 250, 225, 282, 393, 288, 343, 378, 305, 320, 313, 333, 270, 379, 331, 319, 277, 316, 228, 285, 256, 222, 309, 252, 305, 230, 286, 248, 292, 291, 349, 352, 300, 247, 259, 241, 248, 279, 242, 254, 300, 214, 280, 278, 230, 284, 247, 282, 272, 255, 267, 193, 259, 277, 286, 289, 211, 339, 280, 229]
-3759B29J18p5km0J5m1n1O5NkM6N5j1m2k3R1p4j1M7K0q4K0K2j6J8J5j4o5N9j7o0J5O9P3p5
-3724B79q9L0O8r4m1J27k0j7J4n4N3P5j00k0N4j7N3r5L9q4J15J1k0L1r1N1O2m0K7Kk2k9K8
-3691B86o6J0k8NJ13j31l8J09K0k4K2m5M5o8nR7j6k8l9O5qk8J7l1n9P7J9p6N8JK9n4k1J00
-3657C08p3mQ4r5m0J20o0L7m0M9p5N6j7l8P9j2l8J0m6J01l2l1Q6k3nj2k2P5q3L8M0k8O1l2
-3623C38l8k4N0l7P1k3l7n8O1L9k2K5k3l6M8M1o8n5M0k7L4qO0n4m2K8m4OJ26q4j4mj3Q4p4
-3588B66j9P1l1k0k0O0m2nn4Q6k0lm4m9N9K6k5Lk5l3O8J7m7M2No6M7J2k0o7N6L9l1rl6J01
-3552B92J4j08L1QJ7kl8J7K7m8ML9k9%QJ2pm1j3LJ11l1o4K9k5L4pk2Mj8J7K8Rn8k4O9j2k1
-3514B05K5o5%J20q8M4l5k3K9l5M0K2KK4p7N9K7qj8J6j11J02n0j1m4R2k4j8O4k8J0k6l4L9
$$ y = [229, 347, 272, 270, 230, 245, 204, 153, 218, 223, 221, 267, 322, 311, 269, 246, 337, 263, 252, 299, 319, 235, 255, 277, 261, 279, 294, 280, 215, 274, 257, 197, 212, 281, 354, 279, 190, 220, 288, 194, 153, 280, 260, 243, 257, 203, 256, 331, 231, 211, 265, 248, 301, 206, 245, 161, 276, 287, 267, 298, 207, 258, 320, 280, 307, 309, 287, 258, 286, 220, 230, 202, 207, 320, 189, 151, 260, 280, 256, 278, 233, 278, 210, 205, 302, 286, 258, 219, 284, 276, 248, 265, 234, 175, 252, 271, 195, 253, 254, 283, 229, 208, 308, 235, 231, 315, 220, 180, 300, 240, 277, 237, 286, 211, 267, 250, 212, 291, 279, 241, 251, 205, 306, 274, 243, 329, 306, 301, 289, 267, 342, 259, 297, 337, 309, 370, 338, 300, 276, 326, 289, 360, 337, 300, 242, 303, 342, 320, 345, 322, 286, 334, 375, 307, 252, 292, 265, 299, 291, 351, 297, 255, 283, 239, 245, 371, 287, 273, 269, 256, 340, 266, 247, 318, 287, 267, 247, 307, 265, 260, 206, 292, 272, 269, 225, 176, 235, 261, 236, 239, 214, 181, 249, 266, 219, 261, 266, 200, 247, 259, 239, 172, 228, 267, 236, 227, 191, 292, 306, 198, 229, 237, 254, 252, 214, 231, 258, 210, 214, 253, 224, 224, 232, 244, 237, 196, 183, 186, 297, 266, 202, 231, 206, 240, 233, 211, 215, 197, 214, 242, 251, 193, 169, 238, 226, 205, 230, 165, 165, 285, 197, 241, 206, 183, 212, 177, 217, 239, 241, 265, 188, 247, 274, 266, 248, 264, 153, 255, 205, 194, 150, 242, 218, 200, 264, 236, 246, 220, 186, 225]
-3480B25L4j43J12O6r7j5M6K1o6K4L3L2n4o8P0kj5j3K1l8QO2%l5N0K1o5O2j27R6q9N4P7j34
-3446A53K6J9J9rl2O9n0J8npl2M7k7MJ15o9p3K8N8m5k6K0lO5p6J2L2K7K0m9m0j1M9m5P2p1
-3410A83N2j0l5NJ3jj5O4r5P0j7p0K8N8J0l0M1l1j5O8k5n4j7M2p2M5Mp9L4L0n6J00k0j14R1
-3375A82L1m6J9q8R5lJ1k6Q6j05J25j3m6m9J1N8p3Q5l2Mj04J00n6M9o6K8L1J1k4j8m9P3M8
-3342B49j9j6J2j6j3N5o8K4j5l6N4qmkk7Ok9k0J08j06L8k3P9k0N6k9m6l9O4l6N6p6O6m7Rl8
-3306A43L7J3l5M5J8Jj7l5N1Jj3j9K7l0M3p6K4j1J4K1j7lJ0p5J01J1J0j3k1j3%l4N4p4J9j0
-3270A47J8Q9l1j9p0M0J2m4LM4K4J2k1k6k2R4m2k4L9o7P5l6k4M2q6O6n0mQ5k8L5J0l4l0J1
-3235A88K4j7M3q7P7p2lJ3Q3o7J4%p8J09J3o7mJ8M5l0l9Q3r8O3j4o5P7m2O7n1j%r0J03K2o
$$ y = [225, 259, 116, 228, 294, 197, 182, 228, 249, 183, 207, 240, 272, 218, 150, 220, 218, 203, 190, 211, 173, 181, 243, 243, 208, 258, 279, 214, 276, 149, 245, 156, 210, 287, 153, 179, 198, 217, 208, 176, 245, 195, 213, 208, 201, 169, 216, 189, 193, 308, 239, 166, 194, 252, 207, 181, 201, 198, 263, 187, 199, 231, 258, 278, 229, 189, 178, 227, 182, 254, 183, 235, 225, 190, 195, 208, 207, 192, 256, 161, 231, 214, 144, 172, 230, 240, 210, 251, 220, 205, 273, 248, 194, 177, 219, 147, 192, 196, 117, 151, 181, 125, 225, 205, 91, 182, 213, 167, 186, 98, 193, 190, 201, 175, 261, 156, 281, 268, 222, 173, 184, 242, 169, 254, 222, 226, 122, 222, 166, 215, 149, 177, 208, 219, 195, 177, 128, 201, 249, 230, 214, 226, 210, 197, 252, 184, 208, 193, 157, 211, 203, 199, 197, 170, 176, 147, 127, 235, 129, 167, 144, 223, 203, 259, 230, 184, 145, 209, 173, 229, 153, 219, 172, 181, 143, 180, 193, 158, 203, 221, 222, 205, 170, 221, 222, 209, 190, 217, 187, 230, 154, 178, 167, 181, 202, 185, 182, 192, 117, 218, 229, 239, 226, 205, 192, 192, 158, 212, 138, 157, 147, 165, 254, 223, 204, 134, 174, 186, 142, 145, 189, 213, 225, 204, 178, 156, 250, 208, 184, 223, 156, 231, 195, 171, 213, 127, 193, 143, 139, 224, 196, 231, 241, 207, 177, 188, 212, 195, 238, 151, 228, 156, 153, 166, 249, 182, 196, 196, 118, 227, 240, 173, 169, 187, 232, 202, 163, 246, 148, 211, 197, 132, 209, 167, 234, 183, 182, 182, 92, 195, 217, 211]
-3199B11M9j11O5m7M6o2M8o7K5P3o0K7l5R8q5N4j2n0O3K6q6J2k0M5k2j8L1j8O9j3j1l4p0L1
-3165A52K2j1K7M7j5p7P2l8l2lJ17r5N7p3L6j0KM2L9j12M2oJ4k1K8K2p8Qo2O4O5k3j9J5L3
-3130B29L1j12R8j15P2Ml5Rj9Qj7M8k5N0j04j8J35j6j06J11N%p9N6L2p5O8%L3j13M6N7j4m2
-3096B02L8j61J37J8p5O5l5P1l4o3J3L5O2q4K4l1o2Q0K1n4K0l3O0NKN8o5K5j37Q4K7J7O3l5
-3062B58r6jM2k4O6o6J16q6K1p3K1J00r4O6m6k4L3m2K1M6l9m4R7Pr4K0mM7o3N7l0%N3n9j2
-3027A74OnL8KJ3K6o6K9jNjnl8J2K7j8K9j9o7Q4K2l8l7M8OL8j12L0P5lp7Q3r8R6j1J1L3n4
-2989B37MO4o3L9j7q6PM1j0M5M6p3P2n2k2L7k0Q6j2q2PO6k2jk8L2J8M7K5j48L1R0m2L0jl7
-2953C08Kj1K0K1K6j08J16k9m0M5QJ4lOl9M5O2j7O4j8%pj7%m2L3k6L8k9P2m1%M1j7K7o5J2
$$ y = [211, 260, 149, 214, 167, 213, 151, 199, 132, 157, 230, 170, 197, 162, 260, 175, 229, 217, 167, 230, 256, 170, 182, 162, 207, 185, 167, 198, 180, 249, 236, 225, 191, 121, 152, 174, 163, 190, 237, 222, 145, 217, 179, 147, 144, 261, 166, 223, 150, 186, 176, 178, 220, 259, 147, 189, 183, 197, 176, 204, 226, 148, 156, 94, 158, 223, 200, 181, 196, 229, 260, 148, 246, 131, 203, 207, 172, 181, 162, 170, 153, 201, 176, 226, 122, 104, 239, 223, 117, 228, 233, 233, 154, 210, 242, 167, 235, 235, 268, 155, 201, 258, 244, 202, 240, 79, 216, 234, 159, 224, 189, 260, 226, 163, 176, 211, 273, 189, 213, 182, 120, 200, 221, 167, 187, 154, 214, 219, 221, 279, 214, 239, 102, 186, 213, 230, 293, 258, 162, 161, 203, 179, 245, 179, 295, 209, 230, 157, 178, 278, 184, 250, 204, 180, 213, 171, 192, 238, 199, 155, 252, 259, 165, 185, 181, 228, 165, 222, 192, 192, 245, 186, 174, 180, 175, 213, 215, 228, 254, 188, 217, 216, 221, 220, 215, 177, 189, 216, 198, 227, 208, 141, 225, 247, 209, 172, 220, 226, 264, 152, 182, 257, 254, 177, 260, 162, 258, 247, 258, 291, 237, 241, 305, 242, 281, 264, 178, 185, 226, 216, 261, 307, 234, 306, 254, 232, 269, 249, 335, 323, 241, 248, 314, 292, 291, 263, 295, 313, 360, 385, 237, 268, 358, 316, 346, 345, 308, 310, 299, 319, 340, 366, 258, 374, 345, 305, 350, 358, 372, 369, 375, 336, 381, 443, 426, 490, 472, 472, 465, 448, 448, 406, 439, 413, 451, 422, 494, 453, 453, 494, 477, 504, 439, 451]
-2916D51k6P1j1p6R6l7pL0K8p4j3J15j53R9q8O4j10N6O7n7J0j8O0J3o8K9mR0p1J1O2J05l6
-2883F08L6O9j7N4k1o9l7p9j05R1j00J43p1q4P6m5q0J03q7N8l5M5j25O4P0n5On2P2j8oPm8
-2850C68j6jJ01K0p1o5L8Q2n1j0o3j1PJ81j18j2J8j3MpM0M0m5lL6k3NP0q9R8n2j8p2j4L6n2
-2814C38M4N1j05O7o8k3k7J6L9j6L8k2k1P8m2l5L0q7J02J9l9J3%m8M3K1l7L1q3N1r2O9k2m5
-2780B38J51r6j6J5J3K8k2J0l7J8l4O6Pk6L1k4l2N1j28O8L6k8N5q1O2j11R8p1J29j34K9K7
-2748B92M0m1l8N5p6L3N5n9lM6LL4k0Kk8K3%L4L1p0On0L5k4Nj6l0K7O9r4M6J2l0P9n1R1p7
-2711C11m4J6Q0p6N3l0nL0m8NL9J2k1q0L0P4r0j5K9m9N7j6M3n2LPK9q6R0j3l9M1Rn9K6n2l5
-2674A74J15l8j1K1k1O9o6l0N2l4mPKl2K1L5m9M6L1j12Q1k8M9m2k3Q7q8K1O6po2O6k3qm5Q
$$ y = [451, 425, 496, 485, 409, 505, 468, 461, 491, 519, 445, 432, 547, 394, 493, 405, 469, 359, 415, 482, 425, 435, 417, 477, 490, 422, 451, 447, 537, 466, 477, 539, 644, 608, 644, 713, 696, 750, 729, 660, 623, 544, 439, 530, 430, 573, 502, 418, 494, 449, 369, 472, 385, 443, 408, 453, 328, 392, 462, 407, 413, 361, 433, 415, 409, 416, 368, 352, 351, 452, 472, 401, 336, 374, 456, 405, 395, 332, 321, 328, 509, 391, 379, 397, 384, 388, 381, 421, 461, 416, 413, 449, 426, 431, 501, 412, 510, 458, 440, 368, 354, 390, 338, 382, 433, 328, 395, 327, 304, 277, 293, 332, 316, 354, 332, 311, 389, 347, 312, 342, 255, 357, 376, 337, 350, 350, 302, 345, 366, 329, 360, 277, 328, 236, 305, 283, 238, 389, 293, 277, 292, 305, 333, 311, 321, 284, 302, 268, 334, 341, 315, 346, 322, 290, 341, 213, 281, 317, 289, 344, 263, 325, 214, 312, 241, 370, 236, 265, 292, 332, 291, 253, 308, 232, 265, 320, 261, 258, 304, 307, 341, 321, 323, 295, 318, 318, 352, 383, 313, 319, 269, 304, 280, 285, 269, 239, 266, 335, 241, 287, 299, 269, 348, 297, 388, 311, 267, 283, 363, 287, 340, 310, 305, 335, 287, 292, 331, 343, 322, 242, 272, 346, 256, 241, 270, 221, 278, 262, 305, 253, 256, 263, 292, 206, 296, 283, 244, 285, 294, 235, 261, 209, 174, 289, 251, 240, 261, 240, 309, 243, 213, 265, 231, 227, 234, 236, 204, 225, 260, 211, 257, 288, 176, 257, 229, 278, 236, 213, 300, 212, 233, 299, 292, 230, 296, 273, 265, 220, 228]
-2638B28M0N5j71J7N5J2m1k7J3P9j5k3l4J6L1L0l6L0p1J1Qj8J10n1m4O4K7j23M1J3M5r3L1
-2605B09l7kN5m8J7N0m6N3n6K1n9M1K6ML5k8m7P2p0k1R5n3J2M7q8l6k4Q3n2Kk9Q2l8L8j2N4
-2569B50n3L5l3l9J22j08M8kn7J7%K4J6m7N6Rn6Q9j00K4j5P1p3J03o7Kk5J3p4J28j0p3N7m
-2535B28kK7q6J2N8l0oj4N4kNRj9o2K9K0l7J0P0q6O4r2L9k3K3rN7o4M5o0PL4jL0M8m9o8P2
-2497B31o2N1L3n9K0l3M5n6M4l6RmKJ7PK1l4OL9k3L7m4J1q4J16r6j6J9M4O6n3k0P5l5rj4o2
-2460A53pP0K1j6n3L8j2j0l7Q6%o6J03j11J7q5J09j9N2J7j06P6M3j09j3R8Pl5J4k7K8Rk7n6
-2426A52P5mk7k0K0M0n3k0L5n9Q6j0l0Q0q3j1n4R1p1P4J1P3l4m9J6j2Nj%k5L6N4l4l0L3r8
-2390A56O5l1kNm1O2l5J0l4O6m6J8m3K8L8M3q8l5K6N0m2m4N3K9j05N5M4M8p6m3R1q5R5o4J
$$ y = [228, 268, 323, 152, 169, 224, 236, 195, 168, 181, 260, 245, 222, 188, 204, 235, 265, 229, 259, 188, 199, 207, 189, 299, 248, 204, 268, 295, 172, 213, 226, 271, 178, 209, 172, 170, 225, 177, 194, 244, 198, 251, 195, 216, 157, 198, 224, 228, 263, 235, 188, 260, 190, 169, 264, 211, 223, 270, 182, 146, 122, 205, 153, 155, 126, 208, 170, 208, 196, 250, 197, 232, 199, 160, 282, 174, 222, 220, 163, 180, 180, 204, 220, 173, 229, 238, 182, 271, 171, 195, 180, 251, 178, 281, 214, 216, 191, 204, 130, 258, 248, 175, 232, 228, 226, 253, 167, 179, 237, 207, 201, 187, 241, 239, 244, 253, 234, 172, 201, 221, 184, 194, 264, 178, 242, 150, 189, 166, 189, 180, 237, 173, 218, 158, 165, 199, 198, 228, 276, 227, 159, 231, 169, 220, 253, 194, 214, 181, 226, 170, 214, 178, 187, 183, 185, 202, 209, 230, 196, 202, 241, 218, 255, 211, 222, 138, 254, 158, 142, 161, 205, 271, 218, 198, 273, 238, 229, 215, 153, 146, 216, 237, 221, 168, 206, 194, 184, 147, 233, 233, 167, 270, 159, 176, 91, 200, 181, 233, 250, 144, 220, 263, 154, 141, 239, 246, 211, 225, 198, 226, 235, 208, 152, 227, 223, 196, 176, 196, 236, 183, 163, 198, 139, 225, 215, 185, 265, 182, 171, 117, 208, 137, 211, 222, 295, 261, 212, 228, 216, 221, 220, 220, 195, 231, 285, 251, 221, 254, 156, 221, 190, 188, 193, 152, 214, 179, 189, 155, 221, 175, 193, 150, 178, 216, 259, 171, 136, 162, 212, 170, 126, 179, 208, 103, 158, 202, 250, 174, 131, 222, 137, 232, 168, 169]
-2355A69N3j1qk3oMM8p9N8pKmP7k5m9j4N5k0K2k1R2j55K5lJ4l3M5j1L1j20N6J5o0N5J4N7r1
-2318A52M4n9J37r9P2q3K4l5N5kJ3nk7jm6RP7l4Q9q3O9p3j4P8l1Jo4K1Ko5J17l4%k0n9Q0l4
-2281A72K4L5j11J3J16q3J1LL8%Qn8L9j9p5N2l9K1lL6n2N4k4R6j3n3n5J02n7J0k8O8J2q9K0
-2246A71rK5n8N8l4Po3M0J06p9pRk3N1L7o0QLOo2K2JK5l7J2N7Nm9nk7K3O5n2Qmk8j9l1O0r9
-2206E3Q2J2l0N9n2M9k5K3L4j15J33o6J5n7JQ8r6J01k0K1m0J5Qq0N2l5O2p3Q5jj39J08q8P5
-2172A59j6lM3K2j6q9N0l8L9J9L0l9j6KM5j0L3Ll1k5J3l9Q5l8K2l1k3J15o0o3M6l4O0m7K8
-2137A96k8J3k2N7K7n2L1J5q2m5R8qk6N0k9r7O9M5j53J76q8K1O4p6o2M9M5m8O4p2l9K8P7n6
-2103A42L0n1M7M7p4mKL1L8K3j8n7L7rl6N1k8j04O9k2MN2p3Q1oMO1n8Ql3jQl6N9m4QPK8Pm7
$$ y = [169, 222, 211, 203, 180, 174, 178, 226, 147, 205, 198, 200, 196, 273, 248, 199, 185, 240, 220, 242, 221, 313, 158, 183, 180, 194, 161, 206, 195, 226, 106, 162, 177, 117, 172, 186, 243, 152, 196, 137, 274, 175, 247, 164, 188, 153, 208, 206, 219, 214, 187, 186, 140, 149, 226, 192, 281, 198, 267, 194, 180, 258, 227, 228, 164, 185, 187, 122, 239, 205, 205, 185, 126, 206, 172, 196, 231, 120, 133, 249, 166, 177, 180, 218, 218, 226, 168, 207, 188, 113, 165, 126, 147, 144, 180, 128, 182, 158, 254, 241, 188, 133, 235, 178, 188, 160, 228, 240, 151, 171, 162, 187, 129, 187, 153, 160, 97, 137, 243, 164, 157, 166, 143, 194, 231, 171, 179, 182, 188, 126, 148, 149, 174, 137, 149, 206, 211, 162, 157, 130, 153, 218, 166, 174, 170, 142, 123, 92, 152, 53, 135, 147, 117, 176, 124, 173, 148, 171, 205, 90, 223, 157, 172, 115, 116, 204, 108, 209, 189, 210, 170, 185, 193, 113, 165, 130, 192, 119, 204, 203, 64, 172, 84, 159, 143, 140, 183, 205, 189, 100, 150, 112, 151, 170, 200, 161, 145, 147, 192, 182, 215, 218, 187, 162, 175, 136, 221, 183, 205, 174, 151, 266, 206, 143, 189, 155, 215, 168, 196, 168, 181, 159, 216, 243, 191, 222, 237, 155, 110, 208, 200, 174, 224, 195, 98, 167, 212, 59, 235, 147, 168, 232, 156, 94, 143, 188, 140, 204, 132, 93, 121, 198, 142, 172, 121, 168, 215, 141, 137, 139, 170, 208, 231, 213, 156, 193, 184, 148, 199, 171, 67, 136, 114, 118, 170, 97, 178, 172, 176, 237, 179, 187, 154, 153, 161, 125, 184, 140, 148, 155, 183, 190, 143]
-2063A43K4j8P%l6QR0j8%l9n1J1M0n1O6l2Q8l4Pj09K7R8l6p0N3j5PK8l3M0l5kjl4J9J7l7L7
-2025A59k3J7M7k9jm8O2o8M5K8k8N5l0M2o6j7M7j7n2M1l6M0J3m5M1K0J5o1L7j8j3k2L5j4n
-1990A51J9l7k5O5m6J5N4o8K5m2L7J4L2q8R3n2n9J24m6Ol8J10o3Kl4KL6r5N1L5J0m0K0j3K6
-1955A81k7J2K1l0Qk3JJ6NJ2q4P7J4J9l4K2oL6n3%KL6m4j0K8J5nr9L1N8N0m4m7J07j34M3L6
-1918A90j9j1K9Rl4L7n6M6m6J2N5k1m1MNL1l8L9o2M2M2m6M3J3p9j1O8p2J04k8q9R5JJ0j00
-1883A22N4J2Kp7k6J01R3j78R5j4J6Pk7jkpJ0j3J2p4K5M3RN3r4K4J0l5N2npl1M3m1mj8O5R9
-1845B93j16o1J08m6m0O3K5j36O2l1R8j06M0M6n3K7K3o4J07j03J9P1r9J14k7kj5n5L2m5K1
-1814A50Nk0N4l6k1M5n5k3L7QJ7K9o9j6O7K0o2l4JQ3m4L5M6Qp0k0JK2Rk2Kk4Q5j1j38R5Mk3
$$ y = [143, 167, 149, 156, 156, 120, 128, 218, 200, 200, 161, 110, 121, 161, 110, 176, 144, 232, 198, 205, 96, 123, 221, 185, 115, 168, 153, 160, 188, 155, 195, 160, 158, 157, 123, 142, 159, 122, 159, 136, 153, 200, 171, 170, 122, 184, 116, 161, 189, 161, 216, 186, 228, 162, 145, 192, 175, 123, 164, 128, 168, 181, 136, 177, 197, 212, 151, 188, 170, 157, 135, 170, 156, 151, 170, 133, 108, 173, 127, 142, 196, 128, 153, 111, 148, 162, 194, 106, 199, 147, 88, 212, 166, 172, 134, 244, 181, 183, 149, 151, 187, 92, 143, 178, 188, 148, 168, 155, 181, 154, 166, 187, 157, 165, 142, 143, 159, 164, 176, 92, 169, 183, 202, 168, 190, 184, 220, 167, 167, 169, 205, 161, 151, 179, 194, 189, 90, 121, 179, 229, 185, 138, 245, 111, 154, 190, 171, 160, 189, 198, 164, 201, 145, 191, 145, 157, 212, 191, 150, 154, 159, 190, 152, 191, 129, 171, 213, 167, 210, 223, 144, 133, 201, 129, 233, 205, 116, 211, 212, 222, 122, 176, 188, 190, 113, 87, 188, 281, 103, 198, 184, 200, 207, 180, 179, 177, 170, 180, 167, 179, 105, 130, 173, 182, 235, 141, 165, 175, 140, 192, 187, 180, 149, 192, 151, 147, 129, 194, 293, 177, 116, 224, 178, 138, 201, 226, 90, 152, 121, 219, 113, 153, 199, 146, 173, 196, 132, 239, 136, 155, 226, 127, 241, 214, 212, 197, 142, 174, 129, 150, 155, 135, 189, 153, 132, 177, 122, 99, 136, 144, 161, 190, 121, 105, 172, 192, 130, 96, 97, 180, 136, 171, 217, 225, 155, 135, 136, 158, 167, 145, 147, 123, 208, 197, 59, 154, 158, 135]
-1776A35L2L8r9k0J12k5k6j8L7L5J4r3P5n0J7N8n3l1J07r7M2o9K1j0J04o9oM3m6k9O7o3O7
-1743B00pj00JP0J3kl3M8l9l4J9M1m9M2m3L4M7r8O4o9KK1O2k8K4q2Q5k3L4qoJ8n8J9L4o6N2
-1706A85r7K2Q0J1l6k4L1L0j0J7n2K0L0n5k6J3R5r4j3K9JM7r1Q4mm3L8p7O6o6M9LJk9L8k9
-1670A44j8M5l5MP5j01nK9Q9n9m0mN2p3Q2M4j12j2M4O1N7r2k3NL1n1L2mJ2N4j22L7K6l9K8
-1635A61O0n9j3n7J03o8L8K0J2n0n8J17q5J0O0J2k9NMk4JP8o5Nm1%P9l2l2m2N6Rk4jP7r1j5
-1598A21ML6P6J6j20O0m1O8l1k0l5K1m6N4N0r6j8J18l7n1Ql8M0l7O2On0j0J27r6R1k5n5Pn2
-1563A07O3j9l7L0L6K8p9J2L7Rk3Km2Q9M2j65R5j24J46j3k9l2L8M3l9K5N0p1jJO0q2k5QJ5
-1528A55LO2k1k9K9m0o1J5PO1j09J03olJ1K8l5Q6r4l6M6J6J5l3J3k8k5K6R6m7n3N4q0K1M6
$$ y = [135, 167, 205, 106, 86, 198, 173, 147, 129, 166, 201, 215, 122, 197, 147, 164, 222, 169, 138, 245, 148, 190, 121, 142, 132, 236, 167, 161, 204, 158, 129, 196, 133, 200, 193, 93, 94, 164, 177, 175, 142, 190, 151, 117, 136, 177, 128, 170, 127, 161, 208, 110, 174, 105, 107, 128, 190, 162, 186, 104, 189, 166, 200, 192, 186, 204, 146, 165, 199, 133, 185, 88, 110, 190, 201, 165, 141, 172, 202, 192, 209, 157, 177, 207, 152, 126, 139, 234, 140, 127, 156, 157, 204, 113, 197, 193, 150, 188, 111, 177, 111, 160, 163, 164, 135, 173, 144, 126, 171, 136, 140, 215, 114, 109, 138, 227, 168, 128, 124, 176, 103, 185, 229, 117, 105, 149, 210, 267, 175, 152, 157, 188, 137, 169, 165, 177, 231, 109, 146, 172, 133, 161, 221, 162, 149, 92, 195, 127, 165, 185, 197, 147, 89, 206, 121, 131, 191, 203, 174, 179, 183, 159, 160, 238, 173, 178, 137, 137, 216, 184, 152, 110, 166, 175, 151, 150, 227, 136, 121, 125, 161, 237, 253, 133, 193, 152, 220, 189, 169, 134, 155, 109, 163, 213, 117, 99, 217, 180, 129, 137, 99, 139, 102, 164, 170, 120, 110, 237, 141, 232, 207, 152, 159, 107, 170, 151, 114, 144, 180, 208, 129, 141, 178, 187, 164, 166, 124, 213, 255, 90, 185, 61, 207, 194, 165, 133, 171, 214, 175, 200, 250, 179, 178, 179, 239, 157, 132, 140, 155, 158, 220, 199, 170, 199, 159, 98, 113, 120, 181, 72, 175, 169, 166, 177, 205, 170, 256, 162, 126, 172, 188, 203, 170, 183, 155, 130, 156, 252, 205, 152, 206, 126, 147, 193]
-1493A93q2N7j3QlK1j9O3j7l7l1K4J3n4J09j12lR5m5L6k4Qj6l1K2L3m9O7r4NRO7p0k7Q6l2
-1457A57M7k9J5o8K0J4k9M7K0l1n3M1J7o8N2OO8m2l2K9l1M6n9P6l4l5O4l6l9M0oL3j54J00
-1423A46l2M4K1M4m7o3K8O8p7P2jl8K3r0M6N5l6MM4l5M3m0q3Q3%k7K6mNm4J0jPJ9KK4r6J20
-1385B20q4Qm1Q8n9O5j9LML3l6l9Q6m8m1J1Q9l2q7Q1r2R6l5j00J69l9p6L6m3P7l1Jp3J00p2
-1350A20M4rL1p2O7rq4N0Oj3J11j16N1k4j8KM6k5MPk3M9rk2M7l4Pq8N8J6j3pL1J4J6p7M9l9
-1312A44N1j3l6k3Q9mj4J1m4L8J6j7o5N0j7NJ7j5N3r9P3Om5m2M1lq5P8K7m8Q0Nj17M0K8ql2
-1275A25J8MrO2qo2Q6m0k8O0l0qpQ3o6m1N0l5M1J3p2l9O4J3j6PO6j06K2N5n6l1R1l4J9m9j7
-1238A25Q5q3OM0m9P0M2o7q0N5k9O2l9R9j55J32M0o7k9N0k6N1j28OP0j3L7pp8L2JM9l5j4R
$$ y = [193, 111, 168, 155, 163, 160, 181, 162, 225, 208, 171, 140, 164, 177, 123, 232, 120, 117, 212, 167, 203, 179, 187, 171, 140, 162, 195, 146, 213, 119, 124, 133, 200, 130, 103, 189, 157, 204, 175, 190, 122, 142, 156, 127, 174, 194, 163, 110, 151, 168, 100, 152, 158, 226, 184, 152, 181, 150, 196, 137, 213, 179, 144, 208, 172, 133, 173, 167, 200, 46, 146, 114, 158, 179, 223, 176, 113, 141, 209, 132, 204, 203, 165, 188, 98, 144, 199, 163, 167, 211, 176, 219, 179, 96, 179, 179, 152, 178, 174, 179, 135, 145, 144, 151, 170, 172, 196, 100, 220, 136, 144, 103, 191, 132, 197, 178, 181, 185, 218, 182, 143, 229, 181, 140, 151, 240, 208, 121, 202, 110, 206, 171, 71, 240, 201, 125, 161, 118, 195, 164, 165, 92, 192, 120, 164, 155, 186, 114, 181, 172, 88, 138, 144, 131, 242, 126, 177, 153, 135, 137, 183, 158, 162, 169, 146, 195, 186, 164, 211, 177, 184, 96, 154, 170, 157, 150, 181, 195, 211, 134, 183, 144, 195, 182, 146, 123, 212, 208, 194, 205, 161, 199, 215, 198, 133, 183, 166, 171, 188, 173, 226, 127, 200, 206, 161, 119, 160, 157, 72, 150, 177, 129, 209, 214, 97, 137, 165, 157, 125, 143, 147, 138, 200, 192, 130, 216, 176, 148, 208, 178, 170, 163, 246, 180, 139, 189, 154, 195, 208, 136, 97, 161, 174, 158, 165, 231, 125, 147, 202, 146, 115, 206, 172, 191, 142, 125, 210, 127, 133, 173, 124, 194, 236, 169, 89, 144, 115, 177, 138, 237, 82, 214, 254, 187, 158, 208, 182, 233, 105, 111, 181, 168, 205, 198, 120, 152, 153, 202, 167, 153, 162]
-1203A62N1m3pjJ1n4J01m8lJ4k9L3J0Qq1L7J4l1J7j2J6pL4n7J9N7o5J6L6j2j8k8K4k6l1O9
-1167A76j8l0Q5k7o1MJ07p2r5O9O8q0L7M3p7O8L3p0M2o8j1P9q2P1J6n0M0Ll6j7N6j3k6K1j6
-1132A69K7l1P1q9j0R4n4j07J37q1N9j8m1P0r0P1L0n7k4L6l2J12o7m0l6P5rj0j01J46p4P5
-1100B01l4K1k0Q0l2j53J67k9pj2q8J42n5k8L5L5r4n7Q2K3l4K5O2n8LO1jo9K6m1L2M1j20M9
-1066A53j0L0J7l6L3k5J3m7lQ2k2K3M5j44N2N9l7l3J1J06j44O9k3j1qm4J4R2l5N5k1j10N2
-1033A53k1K6O0q3N6Kk2j8m2M9OL5m2J0Q3l9L3lr2PM8j2q2J01n2P0j50J9N6L4k4J4k5m0L2
-998A47%M9l8j6J5j8P6j6J0j9qk3M5o1O9l1LJ6p0R7p7L8m2KmK7nK5Q2j61P6k7kN4k8l3j3M6
-960A85NpK2q9M3k3Q0p3l4N0O1m0r0Q2k5J8n5J04rm0K4l2JjN2n9rj1P7m6Nk2l3R7q1O1l9M5
$$ y = [162, 213, 170, 163, 162, 173, 119, 220, 172, 169, 183, 154, 187, 197, 205, 124, 161, 175, 144, 161, 149, 165, 158, 192, 135, 154, 211, 146, 162, 198, 186, 168, 140, 164, 138, 107, 176, 158, 128, 213, 186, 125, 129, 236, 164, 69, 138, 206, 126, 163, 206, 129, 197, 230, 160, 202, 134, 123, 202, 120, 191, 207, 157, 197, 200, 164, 147, 203, 190, 164, 185, 169, 196, 165, 236, 147, 137, 231, 177, 70, 207, 126, 185, 167, 126, 196, 106, 177, 207, 150, 126, 162, 130, 242, 175, 135, 99, 174, 165, 155, 54, 200, 126, 201, 167, 188, 168, 248, 216, 63, 230, 201, 194, 182, 94, 236, 181, 153, 188, 223, 129, 72, 154, 177, 143, 168, 230, 172, 175, 236, 235, 166, 192, 151, 183, 224, 104, 153, 143, 173, 190, 154, 187, 162, 175, 128, 125, 207, 185, 208, 253, 109, 161, 220, 183, 150, 161, 267, 123, 192, 169, 158, 150, 106, 120, 212, 177, 232, 211, 101, 153, 132, 158, 218, 135, 191, 193, 171, 153, 111, 160, 166, 201, 159, 169, 252, 213, 246, 243, 151, 158, 206, 194, 112, 213, 161, 231, 81, 100, 156, 190, 166, 180, 155, 115, 147, 147, 196, 158, 142, 157, 139, 215, 199, 209, 190, 182, 159, 204, 143, 212, 181, 184, 200, 130, 227, 150, 188, 146, 148, 144, 171, 166, 191, 273, 112, 188, 161, 159, 213, 185, 152, 139, 185, 190, 183, 205, 116, 159, 136, 216, 143, 109, 159, 220, 180, 90, 172, 147, 165, 110, 214, 205, 165, 189, 157, 158, 157, 209, 150, 141, 130, 207, 161, 166, 144, 111, 208, 127, 188, 149, 194]
-922A94j6L6l9l2N5l6K7o8MQ5q1N0k4P8J4k9ko5L2MrM4k1m6L2o4O5k4K9jM4l2j19J07Lp5L2
-885A52m5O1L5r0J3N0Nq4J00l6O6j0j05K7Q9n6k7J4Qj4J3R2j32N7J1K3q0P9n4j6N2N9q4J2
-851A85k6m9Q1l1J18o0m7k5J9J0N3r9N2o1O5l9L6l6L8mM1l7l4l9P4j6lPO3n0m6%J6N9L5p0
-815A80j5%L3n2KQQ0m5K6j01Q5k1jK1k6J3j7L8k7R4j27J02j04o2J31m9L8r5N9p9Q8P1rj45
-781I4J39q7K2O4m8n9J00j2jMj4K2m9O3j27N8nJ1m9N9n0R6nj9J6J0q9K5K5j5j4L7Q2j05jJ4
-745A92l0K8l5N7J8Jn4kk6P0kLN3q6jL5m8k6L3k7j5RL8m0K3J3q9Q7RJ7K3K3j45J26k2k1J8
-708B07m8J3ON3m6NK1k5J2j2J02j23M5q0J45j15R3l7OK3J5j36P7l3M7j9J3L4n7m7R3j7K1k0
-674B16j8J4o9J06n8O4k9Qo3j4P3p7N3l9POL1k0L2K3n0qN5j2q4P0o7J4j1P0k0kL7m6Lk6kM2
$$ y = [194, 178, 214, 175, 143, 198, 162, 189, 121, 125, 210, 129, 179, 155, 233, 247, 218, 216, 151, 183, 187, 178, 222, 201, 155, 187, 123, 188, 164, 193, 192, 236, 204, 85, 192, 195, 120, 152, 107, 168, 203, 113, 126, 176, 181, 97, 197, 161, 227, 217, 112, 139, 228, 172, 145, 159, 167, 153, 166, 258, 126, 183, 194, 217, 137, 216, 162, 146, 198, 257, 173, 185, 159, 110, 191, 160, 278, 218, 171, 146, 165, 175, 228, 129, 181, 120, 185, 146, 182, 146, 184, 180, 221, 184, 150, 111, 185, 169, 166, 173, 236, 186, 140, 140, 156, 215, 250, 180, 165, 165, 198, 146, 148, 156, 236, 191, 217, 116, 201, 180, 179, 200, 174, 187, 170, 208, 181, 275, 148, 250, 146, 84, 215, 166, 204, 109, 168, 89, 177, 248, 239, 94, 233, 146, 168, 232, 184, 125, 225, 213, 212, 216, 202, 224, 175, 238, 111, 169, 164, 175, 126, 185, 135, 231, 226, 207, 223, 233, 144, 169, 194, 179, 165, 202, 284, 179, 178, 192, 162, 190, 155, 212, 230, 231, 177, 175, 149, 219, 217, 220, 273, 187, 186, 221, 173, 147, 180, 153, 138, 147, 185, 145, 168, 181, 92, 179, 188, 205, 228, 251, 106, 232, 210, 189, 207, 159, 172, 178, 231, 185, 190, 211, 186, 198, 186, 288, 165, 210, 130, 275, 160, 253, 216, 222, 245, 260, 124, 201, 168, 215, 196, 209, 243, 186, 139, 232, 215, 236, 216, 198, 212, 143, 249, 191, 255, 226, 234, 171, 157, 230, 153, 206, 167, 174, 180, 211, 191, 223, 246, 196, 188, 243, 231, 147, 217, 150, 164, 153, 223, 203, 201, 238, 192, 195, 169, 167, 209]
-636B09k8j7K5%j5m1Jl7R3mJ9J7l6O3k2o1mPO5j20J24l8j28R9M2m6N3j8k2P4j18K4P7j3j5
-601B09qJ7j48O8L3PO3o7o2M8N5m6pk8J00l9oo5K3klL9k6J0OL5o8O1NJ9n3j3K8m5K5k9K9R4
-563B59k5j00M6J4J7K9n6M6p2nO7n3qJ9j6M3o4O0K9O9r7j3N6j09R2k5n2L8N9kJ0o5Mm7J0M1
-527A99nm0O5m7J4J4j5l8M7NK6j7O9p4QP3j17J09m5j0j1j1mM3q7j9O5RJ2Ql3P7r0NM8N1r7
-490A87m1L1Ql7J18J0rON4Q0N2Q1j20J7J9j03M9q5o5R2r0N4k2l4k4j9K7j51J84n6J1Nl4m7
-456A48M0QK4q8J20n7M2l8l9N4J0L9l0l5K9L5o4P0jj01L1R%K0m3M4o8O0m5R0n2l2O2rjo2J2
-419A82NOk9Q4k9J27j45k8J1J3Q1j2j1k3n6nL4K2l3J15r6l6O2q4R9kj0JN7q8j2J7M3k8N7p0
-383B19R0k2r8N2Q9j09M7j26L0N8o3J04k0n1J7k7J08p7L6l5O0m2l3q4N8O6q3N7Q1o7j5jL0
$$ y = [209, 181, 164, 189, 189, 174, 133, 134, 97, 190, 186, 205, 222, 186, 249, 227, 166, 162, 169, 234, 114, 238, 200, 72, 171, 213, 167, 220, 202, 180, 254, 136, 160, 237, 224, 209, 201, 218, 70, 138, 171, 178, 241, 174, 112, 160, 215, 169, 162, 134, 234, 195, 189, 124, 147, 145, 142, 181, 155, 165, 171, 206, 138, 199, 204, 223, 170, 157, 185, 140, 165, 136, 165, 259, 234, 134, 180, 194, 211, 240, 184, 230, 158, 153, 220, 167, 159, 178, 162, 205, 141, 201, 230, 299, 202, 189, 245, 136, 228, 203, 151, 189, 248, 246, 256, 191, 195, 148, 158, 199, 194, 154, 219, 172, 186, 200, 185, 147, 194, 199, 225, 208, 277, 203, 211, 284, 167, 276, 231, 221, 210, 199, 195, 238, 151, 132, 197, 206, 218, 226, 193, 270, 180, 185, 233, 284, 187, 146, 177, 185, 148, 266, 276, 267, 273, 327, 407, 459, 540, 420, 437, 456, 353, 402, 317, 252, 344, 254, 308, 286, 252, 228, 209, 236, 85, 269, 213, 224, 229, 195, 148, 188, 196, 220, 132, 252, 195, 237, 199, 160, 214, 224, 263, 233, 198, 227, 262, 198, 268, 267, 166, 197, 206, 206, 226, 183, 227, 159, 219, 174, 264, 212, 180, 242, 233, 232, 170, 182, 187, 193, 164, 248, 219, 346, 201, 173, 184, 197, 278, 266, 255, 232, 176, 171, 205, 227, 194, 309, 213, 177, 239, 155, 254, 252, 242, 243, 300, 212, 200, 217, 260, 232, 289, 219, 309, 287, 189, 241, 330, 221, 268, 142, 172, 230, 167, 271, 251, 200, 217, 190, 298, 221, 257, 222, 282, 240, 207, 123, 181, 247, 164, 221, 302, 235, 220, 219, 249]
-350B49q4O7k1L5j7rL0pl8J5m2L0J39j21q7N5n4J10q0QlK7M9q2K1k8P8j5M7n5m2M1kM3p1M8
-314B34j1O8ol0n0K9Pj0M1Lq5Q9ll1l8M2j0j3%k7PM6n2L6o1O9O3n3K4k4Q0j39j4J31r0l6M4
-277B30L6j1K3Qj7Pnj8Q3j55L5k5MLN7rJ23j54L8j5pkN4pk1M3m5rM3J4m3J0M2q8PK7N3m6j5
-238B48J34p7P4l9J53o4RJ39n0N2j23Pp5l9%Kj20P1j2K0j00K9P6L0p6k0M3l6L9P4j31pK6J1
-204B68o6Q0n9O1K8o9M7q1K8PRM7j5J5J9p4L4j1L3n4O9n4n5O9J4k4O7r5N4Nlj0K4l1qL2Oj02
-166B05J43pkm2lj8J2MR5n6l1j7K3P4Qo4j9K2M5o7N0p0K5O0j22K1J10j05O7n3N5lj3L3r7K9
-130B92K5N7m5J2N3n9O2n5Q1m4P0n1k1n4KP2o2K1Lo0P9m8M2M9k1Rl2oQ7qq0m0K4P1o0P1j5
-93D21q1J09p6KLN1N8l9N2p2l4jpP4l5m3J33p8N0j8J02j12l7j0N5P8q3L8M1J3Lo3O1K2q6M9
$$ y = [249, 165, 232, 211, 246, 229, 220, 250, 243, 205, 220, 178, 208, 347, 226, 139, 194, 140, 250, 170, 178, 175, 202, 251, 169, 190, 162, 240, 225, 272, 217, 175, 216, 214, 257, 186, 234, 223, 291, 285, 255, 205, 234, 241, 231, 272, 275, 190, 279, 276, 245, 207, 249, 239, 226, 226, 199, 206, 252, 200, 236, 175, 244, 307, 254, 278, 254, 334, 195, 181, 312, 222, 186, 230, 266, 255, 278, 286, 269, 276, 271, 253, 336, 181, 216, 191, 195, 198, 255, 246, 369, 215, 253, 238, 231, 229, 283, 276, 255, 298, 253, 244, 287, 301, 258, 268, 310, 222, 229, 256, 309, 263, 248, 382, 305, 379, 340, 493, 429, 438, 577, 527, 579, 456, 463, 388, 349, 349, 351, 231, 302, 290, 310, 210, 239, 315, 345, 269, 249, 292, 256, 295, 369, 238, 231, 257, 268, 202, 282, 223, 284, 312, 243, 290, 209, 237, 244, 253, 300, 285, 300, 319, 245, 279, 268, 301, 247, 316, 262, 207, 276, 290, 266, 333, 238, 292, 297, 294, 284, 308, 277, 269, 301, 307, 205, 348, 341, 339, 297, 294, 276, 288, 292, 387, 331, 300, 283, 306, 380, 388, 324, 305, 327, 372, 305, 355, 285, 310, 370, 248, 269, 379, 274, 341, 288, 343, 340, 327, 360, 263, 292, 317, 374, 329, 341, 394, 335, 397, 342, 423, 379, 449, 398, 377, 323, 325, 397, 335, 356, 359, 299, 378, 330, 372, 421, 400, 409, 377, 371, 458, 450, 370, 330, 354, 425, 365, 436, 421, 340, 449, 373, 375, 378, 429, 487, 448, 500, 428, 394, 393, 386, 460, 425, 382, 515, 437, 487, 469, 571, 459, 422, 412, 467, 545, 462, 500, 541, 554, 557, 494, 555, 577, 491, 540]
-57E40K7j0j1J15p9n9J22r2N6KN2K8m2PM8O4%K8Qj6P8J5pJ11Q3N6K08J59M92N79L46k30n97
-24B081m28j29o3J55N1MP0J50J28K25N4M27K76N59N77Q28Q47J565J970L550N892J0617J6519
-1D5925K2409J1666j6955k5718j5997p154l794j878j203p71p86p08p44n50n59l35l62k08k79
17A999n0r0J7j79k7k0K03J88M39M33l45p89m78k28j37r3o9p5r3j2q0K5j8K7n8m1l5M1m0Jq
48D08p3j3rL5k5RN7q9L0k1mj3q7J32k4l1O6p3LJ4l3QL9k4k7m8N0l6L6K7o7J0J2p5M7k0J8J8
86B27J3o6N8q1M4Nm6O0qJ8n8Q4j4p7N5o6L2K3pk1MKl1K2N8N1r6j4M9o6l3k3L0M5K2k4J8qk
125A79ok6k5j9KM4nl0J9O6K8o2L1p4QM9j07J25q4N0Qpk8m4J08r9J18n2m9J6qL3K1lnl6l7N5
163A54K8j1m1N8j6L1j4J2j17R4K9n6O2l2m3j0J2j09J39Qk0l0Q0k5K3q9J20p3J9Lql7KrQ1o8
$$ y = [540, 567, 557, 546, 661, 582, 523, 645, 553, 609, 611, 663, 691, 649, 656, 704, 768, 768, 796, 804, 788, 866, 881, 874, 985, 1068, 1124, 1332, 1491, 1983, 2562, 2908, 2678, 2081, 1653, 1524, 1461, 1616, 1667, 1671, 1741, 1891, 2019, 2244, 2298, 2725, 3001, 3560, 4137, 4965, 5812, 7377, 9347, 12897, 18789, 29406, 45925, 68334, 80000, 63045, 37327, 21330, 14176, 10382, 8504, 7301, 6530, 5744, 5036, 4292, 3742, 3183, 2848, 2486, 2278, 1999, 1949, 1859, 1876, 1697, 1670, 1650, 1853, 2041, 2480, 2913, 2568, 1779, 1301, 1073, 936, 843, 774, 699, 606, 594, 514, 539, 521, 548, 490, 449, 414, 455, 415, 416, 408, 335, 322, 313, 348, 323, 332, 389, 300, 330, 309, 305, 292, 205, 337, 313, 282, 348, 275, 278, 292, 259, 267, 306, 282, 255, 207, 257, 221, 257, 284, 217, 227, 239, 164, 211, 191, 209, 227, 240, 174, 232, 151, 195, 200, 154, 214, 206, 224, 166, 250, 236, 159, 214, 148, 180, 203, 196, 175, 179, 181, 150, 172, 230, 281, 185, 171, 220, 154, 121, 98, 128, 173, 195, 171, 189, 181, 179, 173, 147, 122, 103, 105, 149, 144, 114, 133, 199, 227, 165, 196, 122, 130, 179, 72, 197, 113, 163, 171, 164, 136, 92, 200, 101, 219, 167, 118, 134, 126, 159, 180, 177, 172, 136, 99, 154, 182, 171, 130, 188, 172, 203, 189, 201, 84, 178, 207, 151, 213, 181, 138, 128, 140, 31, 170, 178, 158, 128, 208, 183, 206, 117, 237, 164, 183, 186, 178, 141, 143, 134, 215, 147]
199A47k4l1o6J23k3K2R5j48O6k8L7k9R8j57Q2roK1j2Jm6mj7Q3k1K2n3OJ2L2j3JO5M3j28p6
235F5M8O2l5N9m9m5n1J23n1J0O2m2l1K4MK8o3L7j8L3l2j8MOj4j4jJ05m2J4n4K9P7l7p4M3q0
272H2K1P4n0Mk9K8ok2R4m2l4N4l9k7KO0lJ0l9J1k4K0Qj7k2K0Ol1M3k9KPO5Pp3L7q5J9L4Ok8
313A14N5r1J19q0L7o3K0K0M5m9J5J0n2M7K8ro0N1J2m0P6j4l5Lk2M3m9k5J7K2j5K3j4j8J11
348B32p8m2L8Lk7k6M4qrj2M2K4j4l3k2L1j6l3O9l0J00p2l0Lj7m3K7K2j1K9N0m8k7m2J00o4
384A10M9j0j5j4M1K2j8k7l8jO1p7M9K7J5n9L5M9n6L6L9r0p4P2O3m7L6k8K2q7k0P9l0l8O6K6
420A68j8J4k8n4P7J9q2K1J7K1nJ3K8m4J6p6mO8j3J4k1N1j01N0k9Q4p8l3N5MQL9n7mj5J7N3
457A75j4j3o0N9J4l9J1Q5m8Qo7L9J9p9O3opKj1K4K4J9%j3P4l1p1P1J12l5P6m1O5pj40J6m5
$$ y = [147, 123, 92, 26, 149, 126, 148, 243, 95, 161, 133, 170, 141, 239, 82, 164, 155, 149, 170, 158, 159, 113, 109, 92, 175, 154, 176, 123, 129, 141, 173, 160, 161, 226, 269, 141, 65, 113, 175, 140, 199, 150, 105, 54, 177, 126, 136, 198, 156, 125, 149, 153, 181, 118, 155, 137, 170, 138, 120, 124, 130, 116, 102, 101, 206, 164, 178, 124, 153, 230, 193, 119, 162, 82, 103, 177, 127, 131, 102, 130, 124, 102, 196, 154, 120, 174, 135, 108, 110, 170, 167, 177, 138, 149, 125, 145, 153, 136, 114, 134, 140, 109, 152, 123, 125, 132, 197, 204, 131, 168, 83, 102, 136, 142, 114, 169, 78, 197, 117, 154, 91, 111, 131, 176, 127, 142, 152, 100, 147, 175, 166, 106, 157, 169, 129, 205, 191, 156, 159, 137, 180, 131, 106, 123, 145, 130, 153, 139, 121, 232, 154, 112, 150, 153, 126, 100, 144, 136, 127, 115, 157, 181, 167, 134, 112, 143, 127, 94, 163, 133, 233, 161, 131, 134, 117, 74, 101, 123, 112, 141, 191, 143, 116, 74, 174, 110, 159, 149, 134, 120, 161, 183, 165, 138, 100, 99, 160, 83, 132, 159, 174, 115, 150, 199, 143, 179, 218, 128, 54, 126, 189, 142, 178, 150, 172, 85, 65, 144, 114, 76, 142, 168, 150, 164, 136, 82, 159, 178, 96, 117, 134, 155, 150, 163, 191, 147, 163, 87, 83, 151, 138, 152, 131, 182, 81, 131, 102, 186, 108, 75, 130, 134, 142, 181, 124, 120, 105, 122, 175, 161, 148, 88, 147, 161, 122, 133, 218, 170, 178, 111, 150, 169, 90, 153, 147, 140, 142, 131, 155, 179, 198, 198, 185, 259, 228, 157, 228, 340, 305, 381, 340, 405, 398, 258, 274, 229]
494B29r7k7Q1k1l0P1j8k5Om3M4m0Jj0PLm4J41r9J3O5r4P6mo2K5ro8R6k9K7L9L3j31P6knn9
532A16Jl1K1J8K3K4q2K9JK8k1K5J2k7J7k2J5k0n6K1N1m6N4Mo1M1J3j7pQ0o7q9N1Ql3P6pn0
570I3M9l0K4lj9O8j15J17p0qj0NJ7j0L0k4O9o2j9ML4n1J00n7K3J3J6o9N3q9J34q8J1m5MP9
606A74J7k7j0M2j02n3K5Q6j6L5q8R8j3p6O0Nj2j4J1M2n9L5K1j4J4j9p1O3P1j12M9o2M2j2K7
641A57l2M0j0k7J3j6J4p0L8K8K6o7O7J1j3o2K2P4j00N6n8L1%j1L4k8rN3m4K5j4K2J2L3j3J7
677A99j4r5K6L8m2M5l0P4q5N3Kl3J0n2J1qj3L3P3n0oq0P1O0j9QN5p4m0m0J12j07P0k5N5m2
713A40n3J05j11M5L0Km7RO5n5J1J7k4k9O5l1K8l5L5l7Pl5k7R7m8N4j6n1O5ql1j2J4l5m0J39
749B03q6J1mK1n0L2knP4j13R4J2q8M1J4n0K3J25j53N1J6n0M4l5m7L3mn6Q6N7M2q8m9P5q5J8
$$ y = [229, 132, 105, 186, 165, 135, 206, 188, 163, 169, 126, 170, 130, 131, 121, 128, 131, 87, 228, 129, 142, 207, 113, 189, 185, 123, 148, 139, 71, 167, 138, 165, 204, 237, 106, 182, 180, 175, 116, 117, 86, 107, 125, 148, 172, 90, 119, 120, 148, 127, 152, 164, 137, 154, 132, 147, 127, 71, 92, 143, 97, 151, 155, 94, 135, 148, 131, 124, 204, 137, 48, 99, 107, 74, 150, 143, 93, 142, 112, 136, 133, 114, 182, 67, 184, 114, 106, 96, 101, 118, 108, 138, 114, 183, 121, 102, 106, 140, 89, 189, 132, 155, 168, 184, 115, 168, 79, 213, 125, 136, 91, 95, 174, 191, 164, 154, 196, 94, 41, 66, 152, 136, 171, 83, 181, 168, 92, 152, 157, 145, 131, 142, 184, 125, 160, 181, 167, 181, 162, 91, 154, 225, 113, 162, 100, 142, 130, 157, 125, 165, 155, 128, 141, 125, 139, 69, 107, 135, 161, 94, 161, 172, 159, 97, 119, 193, 93, 149, 91, 122, 122, 111, 145, 117, 108, 161, 117, 142, 128, 150, 162, 195, 182, 199, 185, 90, 116, 154, 112, 157, 127, 201, 116, 169, 171, 138, 148, 96, 107, 99, 86, 119, 192, 142, 136, 56, 127, 187, 168, 176, 231, 157, 117, 77, 189, 82, 152, 127, 182, 140, 87, 192, 81, 126, 156, 158, 111, 120, 185, 130, 141, 158, 134, 105, 170, 139, 167, 132, 167, 130, 137, 102, 75, 172, 124, 178, 162, 111, 176, 168, 137, 125, 139, 104, 64, 203, 117, 128, 124, 145, 95, 127, 125, 120, 194, 81, 175, 187, 99, 140, 154, 104, 127, 252, 99, 150, 166, 116, 160, 125, 78, 111, 107, 51, 137, 194, 236, 148, 99, 174, 89, 107]
785A07O7r3O0k0Qj8O5o9J7N6k8N7p6K9k4mk6M0qJ1l9J4qQ2n3q1M2j4K1j7N0j2K0o9Q9l7n8
822H1P3rm8L6l3K7jQJ0n5mJ8K4L3k5L1%O8n3n3L7n5kmJ3N6j08J13j04N8M6l9JQ0n6m0l0N0
860A44K0K7m8j8n1P4M1q5Mm0R3l7o7J22m5K1k6M0q5J8O3kl2j5jL3n2O0J1jK8l5o8RNM2m6N5
898A56q3J0K4m3R4MPn7M4o4J3N5O3n1%m1k9M1P4o3o0j2L6Pk4N2Pj3K9%mj9J9k7J6Qj6o5K0
937A08%k6Q5o8k3rO9n1K3M6o8K2Q0o9l4L0L4K0lo2pj8M4J4m2J9l0J5p6J49l1ll4J2k8k9N0
974A09J0n8J05j9p5J03l9K9n0j6LP2j2j1J9p6K4K0m5jL5J4K2K9j33N1j5mJ4N4j4j0K9m0P2
1009A96p5QnO3o9qK5l7P5j9n6Q9n7J7j6K1q3Q8j05J26o5L6l7K4Ln8O6j1LM3o0K5J5k8ll8P0
1046A63m0L3p2M7j3L3l2Rj1K3m1%M9m5L5J00j73Q6n1Q5q2M2o0P8r6J7R5K6p7Po1N6k8O5q6
$$ y = [107, 174, 81, 141, 121, 129, 111, 176, 107, 124, 180, 152, 209, 133, 162, 138, 134, 108, 148, 140, 151, 112, 126, 118, 200, 147, 66, 108, 94, 115, 98, 148, 136, 156, 87, 176, 139, 81, 154, 145, 97, 133, 100, 127, 126, 134, 144, 89, 85, 103, 127, 160, 135, 166, 166, 234, 181, 128, 165, 110, 108, 104, 117, 173, 65, 178, 74, 132, 178, 139, 140, 220, 164, 124, 94, 144, 164, 191, 143, 125, 74, 148, 189, 104, 108, 68, 161, 124, 57, 179, 134, 155, 129, 169, 84, 102, 165, 163, 131, 116, 115, 148, 96, 156, 167, 166, 194, 159, 91, 100, 105, 147, 101, 156, 73, 83, 107, 64, 158, 162, 169, 112, 156, 92, 105, 160, 223, 172, 172, 131, 102, 143, 217, 154, 94, 82, 118, 125, 101, 153, 160, 147, 176, 176, 172, 153, 172, 145, 161, 169, 153, 88, 108, 108, 82, 167, 99, 76, 67, 136, 85, 108, 154, 86, 108, 188, 119, 85, 115, 149, 169, 166, 104, 97, 79, 123, 137, 95, 114, 84, 99, 23, 172, 141, 138, 104, 116, 88, 59, 109, 119, 61, 166, 147, 72, 175, 136, 165, 115, 99, 102, 174, 162, 151, 170, 94, 118, 138, 93, 92, 127, 141, 163, 192, 59, 110, 95, 91, 105, 159, 145, 135, 164, 124, 196, 121, 129, 124, 187, 118, 110, 135, 98, 173, 154, 98, 187, 130, 147, 131, 152, 69, 157, 52, 178, 113, 149, 112, 136, 139, 81, 147, 136, 139, 182, 122, 147, 162, 134, 131, 93, 163, 123, 156, 84, 131, 118, 151, 119, 128, 117, 140, 99, 99, 148, 103, 138, 238, 65, 151, 100, 185, 103, 145, 85, 163, 67, 84, 179, 205, 128, 135, 74, 130, 102, 167, 81]
1081H1J21n2k1RJk9P6k7r1J36j16N9N0j28M2k5M9N9J7o7JPk0L3Kn7J2J9o4kK2M7l3P3j4Qm0
1118A38rM0pn7J9K0o0L2qM3M9J7l2k6j1j0o0J1j5Q2kj5p4J1J28j15M3q9P7j7lM3l9Q8o1Kl9
1155I4J2P2l0k2m8R5q4K6L2k3K2Pj00Q5L4k6L5j08J31r2l3N1K6o4M7L0n9J4j8M0j5R1j57J53
1189B18r0l1L1J7k2k5l6J05o4J8l5J10n9Ll1m6R1l7O4m0j01J03N1o9OJ9j1k4j8kL3l4P1L1
1223A96q1rJ00j66O0M2p1J7M0kP5o0j5JJ8m0QJ1%J29j20pJ9n1M0k2NOoM4l2l2N9r0K2J1OM7
1261A52qL0l5qJ4L5j22J18p4P8n7m0L9n3L7pN6J4n4M2p7Q3m9QO9n0r6J13m0M9l3L2k9J1NN6
1297B09k4n9J1P5j46J19j16Q1o5O0mn5O1l0K7m8J8K6rm3O8l5M3J9Jl4j3n2L0K6M0n7M3p4R
1332A02Po1J16m1M3m5M8j2l0m3O9n6o9M9L4jk9KP2p9O0m8L0O6r8J03o5n8P0k2L6p4J4kNo1
$$ y = [81, 202, 150, 129, 138, 139, 110, 186, 159, 68, 204, 88, 147, 197, 69, 111, 86, 135, 194, 211, 144, 145, 152, 132, 165, 167, 110, 122, 141, 77, 75, 97, 144, 111, 184, 170, 178, 138, 129, 169, 162, 105, 124, 144, 84, 116, 108, 151, 200, 217, 185, 159, 148, 138, 78, 89, 74, 156, 154, 139, 65, 76, 204, 89, 132, 43, 120, 103, 100, 143, 104, 192, 131, 133, 94, 106, 178, 148, 126, 78, 173, 89, 115, 147, 124, 146, 153, 53, 138, 172, 146, 181, 73, 204, 112, 79, 130, 156, 92, 139, 169, 110, 124, 106, 146, 131, 222, 65, 218, 128, 97, 128, 145, 123, 98, 62, 167, 103, 121, 86, 196, 137, 140, 109, 63, 154, 117, 181, 141, 40, 143, 194, 125, 131, 150, 139, 115, 97, 95, 128, 94, 165, 196, 115, 106, 206, 40, 100, 142, 71, 88, 128, 126, 201, 141, 126, 127, 145, 105, 113, 124, 124, 253, 133, 126, 145, 94, 134, 112, 117, 123, 117, 161, 129, 97, 156, 66, 88, 99, 105, 152, 144, 174, 139, 131, 145, 180, 58, 176, 102, 180, 123, 83, 122, 69, 106, 99, 155, 169, 115, 157, 80, 163, 114, 122, 191, 141, 45, 158, 118, 167, 134, 166, 137, 148, 153, 209, 185, 126, 137, 212, 66, 185, 69, 150, 85, 145, 141, 86, 147, 117, 144, 96, 114, 140, 131, 88, 156, 121, 164, 183, 184, 150, 137, 85, 115, 141, 181, 124, 167, 93, 102, 109, 48, 164, 123, 166, 121, 169, 157, 127, 84, 153, 97, 28, 77, 111, 110, 81, 83, 155, 76, 136, 88, 118, 184, 86, 189, 124, 66, 136, 114, 150, 76, 90, 88, 93, 32]
1368C2J00k0M5n9M8K3Kp1k0L4J2rl3R5j0m0J9pm3rJ5jK4lR0r0PN0p8M9r2Q8l0J5K7o6MM0n6
1407H2K6j7nK8P7q2L9j7Lok1j4M5K4n4L5M3j2k6p0P9o0lK6k4K8M1m8LK6mn8Q4J3l0rJ3J8m5
1446A28KJ7Nk2oM0m8rN7j8M4j02J3%jL3mP3o5j5Q3m5o4J7J7L8o6R0r3M6m3k0N8K8k0J5q3N1
1484A31M1n6MO6n5J6L3p7l3R8m9k9N0M3k3q4M4j7O0j0q6QJ06o2P0j8r5K3O9q4Q1j2j3j7jK1
1520A43r3R6l8K7Ll0J3K4m8PKO3j6om8M0PL4j0q4J1K8k4K1l1L6J6j4J12j55O7q9OP3l5K7J3
1557A48j9M7q7N0m3m7J26l0j0j1L7km4M2j7l0j0J8L0q1O4l8Q5k5km7J7M3mr3Q4NK2n7l7L8
1593A22p2J11k4k1n7M7K3JL8j9jm3rk9O4M9m8K9J7k5o7L4l9L9L8r1P8Jn8K1NN4r0O7oJ3n5
1630I7j2J37n9o3%P4j5m5K0k3P8n4n6K6m0L7K4k1j4K5M6o8Q1l5j1J0j2m4J0L4QM4r0P7l7r
$$ y = [32, 132, 112, 157, 98, 146, 169, 171, 100, 80, 114, 126, 117, 84, 179, 169, 129, 148, 141, 98, 89, 104, 103, 127, 124, 214, 124, 131, 181, 103, 152, 60, 148, 118, 133, 160, 94, 98, 138, 82, 108, 91, 86, 114, 191, 109, 148, 131, 134, 128, 107, 93, 138, 162, 108, 143, 186, 174, 148, 78, 157, 97, 94, 120, 96, 124, 165, 117, 120, 146, 142, 84, 168, 181, 151, 142, 155, 173, 128, 130, 147, 152, 130, 124, 164, 116, 107, 164, 146, 190, 88, 101, 101, 100, 133, 129, 202, 137, 122, 205, 160, 96, 113, 130, 168, 102, 192, 99, 145, 102, 82, 140, 168, 148, 163, 80, 131, 172, 116, 120, 186, 131, 147, 180, 103, 70, 168, 119, 90, 140, 183, 160, 76, 120, 103, 163, 153, 67, 75, 181, 119, 189, 171, 76, 99, 168, 84, 165, 153, 140, 123, 122, 143, 50, 146, 108, 135, 138, 108, 121, 145, 97, 104, 106, 169, 153, 147, 99, 139, 146, 180, 170, 86, 97, 125, 101, 122, 91, 127, 143, 129, 241, 86, 153, 64, 70, 143, 108, 135, 148, 129, 176, 89, 139, 96, 49, 175, 145, 135, 124, 161, 159, 115, 157, 140, 110, 100, 118, 148, 67, 131, 93, 178, 153, 151, 104, 121, 164, 160, 67, 151, 156, 178, 121, 84, 122, 50, 161, 137, 116, 59, 106, 129, 130, 168, 149, 148, 105, 96, 67, 131, 180, 132, 161, 178, 153, 86, 120, 81, 120, 158, 67, 145, 146, 88, 109, 114, 168, 78, 145, 139, 152, 97, 85, 222, 163, 100, 100, 174, 159, 114, 134, 111, 189, 135, 79, 105, 65, 102, 126, 105, 91, 116, 162, 94, 175, 140, 129, 139, 127, 83, 93, 127, 135, 179, 89, 166, 129, 120]
1666A20N2L9p6K1l1N7j15N1K9N1m6L3on0L3l1l4O6k7J9p6O2M8o6JMl6N0n5K7k5K0L7m3J13
1701B16p3Pp9J8J14r8kL8M5nq7M5Nl4JmlM0q3J0N9%K1l6l0K4J5P0n1L7l3no7M6O0p5J5k6N6
1740A51o9J7%j5j6J22j21N5M0k4j8Kl1R4l4oj2j3j1L9Rrj8K6R5p9j06N8O7n5M1j7n2jm4J19
1776A84m6o3N0R2l3n3kr2R5n5L9j4K7k1l0KL9k3Q3J8r2J4qK9L5j3rL4p7rk1O9nm6N1o0J11
1813B00o6q8L1O1j4j8mR7p6L5l4L4JM2k1N0n5Jn7k9M7J0k1m8R1p3N2k7MJ8m9Q6o2Lk6O7nL7
1851A94j04L0nm6L9K7k6k0J03Rn8k3Q3k9J7m6Oo1N3mj1K9q3L7K3n4M8m0M6J6l9l0M8LQ0j37
1887G5L9k6QL6oO9m4n8N4m1L1j0l0KRJ4K8l7R4J4j19J9rJR9q4j6L7lo2P7o5J3l9P1j5j4Qq1
1926C9l7R6P3J3or9Q2l7J8o7L2r9J51Kr1L2j2K6N1q0N2P0o8j4MrK8l0l4R2o5L7J2Jk5m8Q6
$$ y = [120, 172, 211, 135, 156, 125, 182, 67, 118, 147, 198, 152, 185, 179, 129, 162, 131, 97, 163, 136, 155, 79, 141, 189, 123, 124, 128, 92, 142, 87, 114, 89, 109, 146, 103, 216, 143, 150, 71, 89, 203, 105, 103, 141, 186, 181, 94, 139, 144, 110, 111, 107, 104, 144, 61, 71, 130, 130, 151, 115, 85, 109, 124, 194, 143, 180, 147, 142, 75, 121, 181, 106, 121, 95, 151, 82, 99, 99, 84, 68, 190, 69, 124, 164, 140, 122, 124, 93, 187, 153, 147, 135, 122, 111, 150, 159, 150, 132, 158, 253, 174, 68, 126, 193, 138, 179, 162, 110, 109, 65, 184, 138, 75, 125, 217, 184, 131, 129, 37, 132, 77, 116, 102, 129, 108, 78, 80, 119, 96, 179, 197, 105, 119, 111, 140, 175, 162, 153, 187, 110, 101, 80, 149, 144, 98, 149, 89, 200, 134, 46, 77, 138, 124, 106, 102, 199, 123, 158, 124, 158, 159, 201, 180, 230, 175, 176, 119, 90, 137, 147, 126, 78, 169, 96, 148, 121, 125, 143, 94, 180, 118, 121, 95, 162, 157, 194, 90, 120, 115, 69, 108, 135, 109, 89, 192, 201, 143, 120, 203, 174, 191, 145, 151, 90, 143, 139, 128, 157, 74, 111, 134, 80, 128, 88, 134, 150, 111, 81, 129, 132, 212, 75, 114, 88, 96, 132, 126, 195, 151, 93, 147, 106, 137, 127, 97, 99, 108, 122, 150, 113, 207, 221, 102, 121, 112, 113, 212, 128, 112, 149, 146, 84, 161, 96, 109, 70, 141, 126, 112, 120, 39, 2, 98, 171, 184, 178, 79, 161, 124, 142, 75, 107, 8, 159, 161, 70, 102, 90, 116, 167, 87, 139, 209, 141, 127, 131, 122, 150, 120, 86, 178, 113, 150, 162, 163, 138, 90, 176]
1963A76l9J3L5o4RM3l5M1Qp1Rl0P8p5j8J6PL6m0L7Njp8R8n2nP0n7%L0Nnk8P2l2L1q9L9Pp6
2003G0MO5m7O3m0kM9k5l2k4N7m0P6n9J6j0M0k1M4k2m6J1%PoP8n9rl0o1P1K3L2o2M8po1O9m
2042A56L3q9RO3J5j03LM0oo4P3L5n0k5Q5m7M3L0q3L8o7L6J3NqL0rj4%k6j5k1J10j05N4k6O2
2079A75k6L3q2J9k3Q0j17Q5k9j3L3l8J9J6L4m9kJ00j16J07n2m6P4j06M4oJ1N5j7K1q4K5Q1
2112B06j83R4O4o9k2K0j0k0M6K8m7M9m1O1m6j4pO3p2JQO4k2l5j9P7o1K6j1k6O0j02J21po8
2147A06Q0m2J0L0o6l5M9K5p2P3k8k0J1nM8k5k8L6N1j00Q1q8P5j1n1J15r8R1l1o9M2J0r9O3
2181A28no6J10l1n1%J7j3M6R1j23M3J04m8j05L4j3J7j9l3M5L5o5L9j5l5O2p5J06n9rL1k4m3
2215G6M3j8J3K0O6j22Q9pj03J2J2M1K2l9Q4k9q2O6m1P1o2pJ2N7o5P5l0K9q5R6o8L8k2M1Mo5
$$ y = [176, 137, 150, 185, 121, 130, 173, 138, 179, 187, 116, 125, 95, 173, 98, 80, 96, 103, 139, 99, 136, 141, 140, 62, 160, 108, 103, 173, 116, 116, 146, 151, 146, 118, 190, 158, 189, 100, 139, 146, 70, 74, 139, 92, 155, 115, 113, 162, 137, 105, 81, 138, 98, 174, 115, 131, 121, 161, 140, 184, 162, 116, 127, 127, 134, 128, 206, 147, 138, 108, 47, 118, 141, 173, 111, 159, 152, 91, 160, 156, 189, 100, 109, 172, 187, 84, 87, 127, 121, 57, 130, 165, 115, 90, 175, 128, 171, 201, 118, 156, 89, 125, 138, 143, 135, 165, 156, 142, 142, 116, 101, 80, 190, 85, 139, 113, 175, 149, 182, 100, 119, 96, 176, 59, 144, 115, 102, 135, 97, 116, 132, 166, 117, 115, 215, 99, 206, 154, 108, 182, 76, 120, 114, 125, 180, 163, 184, 100, 125, 206, 23, 117, 181, 112, 90, 110, 100, 80, 126, 154, 107, 156, 115, 176, 130, 116, 109, 172, 100, 101, 109, 173, 151, 116, 97, 174, 113, 139, 128, 102, 162, 60, 181, 174, 106, 186, 144, 154, 184, 118, 83, 132, 157, 85, 158, 130, 110, 121, 116, 164, 139, 111, 147, 198, 98, 179, 91, 166, 155, 104, 219, 121, 212, 181, 112, 154, 164, 65, 128, 123, 57, 167, 136, 85, 85, 102, 89, 135, 226, 103, 146, 250, 202, 97, 131, 118, 135, 116, 83, 128, 163, 98, 137, 122, 87, 149, 74, 180, 121, 112, 143, 119, 76, 119, 101, 114, 134, 200, 78, 167, 160, 57, 69, 81, 122, 144, 105, 189, 160, 78, 144, 103, 174, 112, 105, 117, 174, 109, 184, 154, 183, 98, 194, 126, 164, 142, 183, 187, 122]
2251A22k0N8K7n1O8j04j9M3L5m8lQ2r3pN2n0N2mM5q7O6q2P2J3o6J3K4L9j4m8j6O1j8j6L9j03
2287F2J33l4m2k3M0n0N5m2K6L4k5N6p0K8Rl7n8N1K1J0r4J19o3N7o0O6k9k0P2m7M8m0pO3n2
2322A57q1P7j8J5m5l3K9M1m5L2OM6p3k6M7N4l7K7k6k8%M8M7o6%J8m0r6J03n5Q1m9J4O6l8m2
2358A10J04q8N3j08L2M6q0N9k6K5L4r7M0O1k6k2j2O3K0km0pj2mmKL2j04P3oL3j0jM4o8M4K2
2395A80O2j21R4j13J7Jj7J9QN2p1L4K9k9K3k3L7r7K6K3K9N6o4PJ3m5L0ml3m4O2J2L5r5P5l7
2431A31O1p8Q5m0Nk6R7p4j5Oj0nn6Q8j03M1L4pN1n2kl2Q0K3r2J6N3Mj7l3K6Pq4L7K5j6n1J03
2469A80m7k8l5N3J9L1m0j0j0J8q3K6P2j3j4L0K0o2J9O2m5p9Q2p5J09o5L9m8j4O7p5N0KRk3
2504A22mrj1M7K6o1k9J26p2kM5r4N7l1L4J5jJp7L4Oq0P1L8k7pK0j1kQRj6K5J9l0J4n0m0L3
$$ y = [122, 102, 160, 187, 136, 204, 100, 81, 124, 159, 111, 108, 190, 97, 90, 142, 92, 144, 140, 185, 98, 164, 82, 154, 167, 101, 114, 138, 177, 163, 115, 99, 160, 142, 126, 165, 62, 195, 161, 119, 96, 136, 86, 141, 99, 125, 159, 134, 190, 120, 148, 157, 120, 62, 113, 134, 144, 50, 169, 106, 163, 103, 169, 140, 120, 192, 145, 193, 153, 146, 209, 157, 76, 153, 135, 150, 105, 72, 101, 142, 97, 129, 135, 181, 108, 82, 129, 183, 146, 173, 147, 119, 119, 167, 214, 148, 148, 166, 126, 30, 133, 78, 159, 110, 124, 190, 152, 110, 214, 126, 179, 71, 103, 149, 69, 128, 102, 127, 161, 64, 104, 165, 139, 117, 105, 168, 188, 186, 146, 139, 127, 123, 119, 121, 153, 49, 122, 116, 149, 139, 138, 182, 114, 158, 180, 242, 121, 215, 102, 119, 120, 103, 122, 130, 182, 111, 145, 174, 145, 168, 145, 182, 85, 111, 134, 163, 219, 155, 162, 175, 130, 160, 156, 123, 79, 141, 153, 188, 93, 168, 131, 192, 114, 199, 159, 164, 138, 235, 161, 146, 152, 142, 137, 81, 169, 66, 107, 141, 134, 185, 133, 131, 99, 179, 202, 110, 126, 179, 183, 166, 133, 159, 166, 82, 119, 144, 128, 77, 180, 133, 105, 70, 123, 142, 173, 133, 123, 113, 131, 48, 74, 146, 133, 119, 149, 169, 107, 126, 188, 143, 64, 146, 71, 180, 115, 154, 106, 92, 159, 84, 134, 136, 145, 122, 118, 109, 98, 145, 171, 110, 81, 207, 135, 133, 178, 84, 141, 110, 144, 159, 158, 159, 82, 116, 122, 42, 113, 151, 124, 117, 137, 126, 124, 132, 141, 125, 150, 169, 139, 153, 103, 63, 96]
2543I6j3nl9R9J7m0l9O6P5n5nLo0J09j19J15p7K5J9n4m7L9Nj6qJ2OL7o0M8l5N9j1j7p8J6O1
2580A29m2n1J00K1j8l7JK7k6o0L3J03l9p0K8L7K0m4oNj8O8pl0K3J1K0n3K7M3j20R9j8qj6K8
2616A60pqJ0rM0j1k1J7l9m7l9N2K2K3NJ2kk0r0O9n7K6J03j29L9k6J16j05j7K5P6l6LNk2m8
2652G0P9j3J6oL6Oj43P2j8P6Po1J4O3p9m9O7k9N2r9N9P5no2l7N5L3M8m2j18L5J4m2Q5m7k9
2688H3pJ07q4J7O9%m7no2J29j09P4j9ll7N7K4ll9p4oQ9j9MM8k7M3m3m4jJ1k6RL2P2j43L6J7
2726A23Jn0M8j9O8k2o9M7O6m6j7M5pl4k6P9j15O0M2k7j5M5p4N7ok8m0j7J9M6k7rj07J35O0
2761A86k2o2M3LJ6l4j5RKP2k5j1o0Nl4N9NK0k6j4opL6PqR9j22J5l1L4M7q8M1k9M3m0M2l1k3
2800I6Q0m2m5J32j37L6KOM4j1o2OM1l8q7J46J7p8M0j0m5P7p7Q2j32J11L9m8j0k2M6Jl2O4j21
$$ y = [96, 83, 78, 39, 138, 155, 115, 76, 142, 217, 162, 157, 160, 100, 209, 90, 205, 128, 153, 172, 118, 71, 110, 115, 99, 91, 103, 109, 146, 86, 134, 99, 158, 147, 130, 52, 68, 129, 87, 36, 136, 157, 139, 102, 103, 130, 104, 44, 77, 180, 141, 71, 99, 136, 156, 112, 106, 111, 93, 161, 154, 124, 147, 158, 178, 125, 152, 195, 75, 174, 156, 148, 132, 160, 153, 145, 155, 146, 186, 175, 154, 171, 132, 85, 46, 98, 120, 143, 148, 160, 158, 138, 48, 117, 60, 86, 189, 60, 99, 73, 189, 84, 67, 92, 168, 132, 135, 140, 118, 70, 149, 136, 152, 146, 182, 188, 45, 117, 99, 175, 182, 121, 135, 198, 119, 70, 137, 108, 160, 61, 120, 195, 190, 128, 91, 146, 179, 227, 185, 67, 102, 116, 74, 159, 112, 83, 76, 183, 99, 116, 185, 185, 138, 133, 71, 200, 91, 165, 146, 143, 106, 163, 187, 184, 145, 71, 65, 154, 135, 139, 187, 160, 203, 160, 116, 115, 126, 100, 109, 141, 213, 70, 106, 123, 124, 74, 122, 103, 171, 149, 80, 127, 193, 147, 130, 175, 168, 134, 108, 187, 72, 132, 174, 147, 132, 177, 103, 160, 154, 126, 86, 69, 88, 134, 107, 98, -9, 126, 186, 164, 102, 145, 148, 164, 130, 115, 124, 126, 198, 173, 162, 102, 107, 73, 132, 137, 157, 131, 117, 111, 104, 140, 147, 139, 238, 116, 131, 100, 134, 181, 93, 134, 105, 148, 108, 150, 119, 96, 176, 134, 89, 221, 84, 120, 122, 128, 172, 161, 99, 105, 146, 108, 21, 167, 184, 106, 146, 136, 91, 168, 91, 173, 41, 152, 191, 143, 133, 111, 157, 158, 126, 190, 69]
2835F9J37k7Lk5p4P9n7L0j0pK5m1J0P7j12N9jl0K0J02q6k2N3j17R0K1o6J1L1no4O0Jo5j6N4
2871A07K5L3m9k4J5M6j6J1m8m2J3N4lj9R1r8O2m1M8mm9QRm9N1K3j8O0o5l6k8O1J5j5l0L4k3
2908A09Q3q0kO5r4R0p2Q4r2P8l1k3m0O4pj46Q7J4R5o4pQP2r1M9K3NqJ6m1m2KQ5m7m0O8l0L9
2946A79o4m0J07k8k8L3K7j9m2k0m2J9MP9k8J0j5k2KMO9o5p8J60q4kpJ9L6p2J08j17L9k9K5
2981A18l0J14o6NRJj8kNNL5p9J4nOq1J16Ol1N4n4N5p7Q0o0rK0l5m0N0NJ7k2n0OQ0l9J6M3K3
3021A85n0Nj7Q0j02lQ0j56J13pL1K7K4l8L6l9p5P1Mj6k1Lj2N8oK2oj00Q3q2PQ8o2LOj2njo8
3060D8R4n5L3N8j12O8l6N8p7K0L1l9L4JK3k8K8JM7r7O6n0K1L6j43J12P8j73Q3j5N0M5n6j7
3094A37L3j8M0m6o7ll1L1R7p4M9j5o2L9lM5jn5jK7Nk9J6K3M3l5J7J9p4Q0j06P9K9m2j6j5M0
$$ y = [69, 206, 179, 182, 157, 83, 162, 105, 135, 125, 118, 143, 102, 112, 189, 77, 136, 135, 105, 125, 227, 141, 119, 172, 55, 145, 166, 100, 111, 142, 137, 73, 133, 134, 69, 53, 107, 132, 165, 116, 92, 107, 153, 137, 148, 100, 58, 71, 125, 122, 103, 194, 96, 158, 117, 165, 161, 112, 120, 129, 80, 131, 154, 136, 196, 131, 95, 67, 128, 143, 128, 98, 132, 109, 192, 112, 110, 175, 81, 171, 99, 183, 91, 169, 138, 115, 75, 139, 132, -14, 73, 87, 182, 118, 111, 119, 191, 100, 149, 172, 177, 169, 185, 144, 102, 104, 189, 142, 102, 170, 140, 179, 115, 75, 182, 154, 126, 159, 186, 167, 125, 105, 63, 82, 86, 165, 137, 147, 132, 110, 112, 116, 185, 120, 42, 202, 118, 116, 109, 128, 164, 92, 200, 83, 122, 93, 118, 88, 202, 136, 141, 150, 151, 133, 131, 136, 141, 176, 97, 111, 106, 112, 31, 147, 153, 122, 176, 122, 177, 100, 180, 120, 111, 131, 96, 56, 106, 111, 128, 106, 56, 62, 142, 103, 119, 162, 185, 135, 140, 123, 203, 101, 98, 178, 22, 135, 128, 159, 186, 210, 172, 208, 169, 94, 165, 169, 153, 132, 135, 123, 181, 175, 197, 191, 91, 174, 92, 99, 187, 125, 128, 134, 122, 117, 116, 48, 142, 87, 120, 178, 66, 134, 98, 156, 79, 99, 130, 91, 125, 126, 149, 121, 149, 150, 197, 100, 166, 116, 137, 173, 30, 142, 220, 47, 130, 115, 165, 210, 154, 137, 170, 152, 192, 146, 79, 76, 45, 76, 173, 99, 148, 133, 71, 110, 107, 152, 151, 96, 95, 122, 127, 98, 114, 137, 180, 145, 162, 181, 107, 187, 81, 160, 189, 147, 131, 116, 156]
3131A56L7Pn8p2M0n1Q2j0Njk6j1l1P7l1KM1j8l0K8K7j23J44m0m1Jm8R8l0L8p2P6m9k1K7M0
3167A63N6q9k6QN8n0m3M6q1Q2l7rO3n3R1p8Qj1J4NJ6m1O1Nl2n8O6k0k1OJ7M0j7n9L3M3r5P1
3205A32k8Q6j00k2R3k9l2R2o9N8L1Lp9M7o6k4mO8n5M4n3J8L5J8kk7L0Kn1L0j6n1L5N1n4O3
3241A74k4N0j11J6N1Np4j9Q1l7j2pQ3q7M2OOp8OQ4n0P2j4Ql2K4J0n1nj8m9P4Jp3J28q9L4J4
3279A39k4J4j2k7J7K0l7K9K3K2n6jJ0N6pjP5j49K7L1p2J00r4J03j13M7j7K8J6o1O6l9N6j4
3313A55rL6k9n5q4J12l7J5rNRo2J1K9m5J10q8M4M0mjJ4RO4l1o7K3K1p5m2L9K9N4n0j8Oq5N2
3351H6P1q1R2Ok1Oj5o6P1k6J0o4L3M5p8P3j36J43j6nk1oR1n5K8p8P5q2Q9k2N8j02j0rO4p7
3387G1P6j6n0K2N7r6Q7r4P6k0O5p4J1L9nl4J6O7q1jK5n7M8M3l2j2M9m4M8m1K2j06R8N1j13
$$ y = [156, 193, 200, 142, 70, 110, 59, 141, 131, 136, 135, 109, 98, 67, 144, 113, 115, 156, 138, 108, 136, 163, 40, 184, 144, 103, 104, 56, 154, 124, 162, 90, 166, 117, 96, 123, 163, 219, 130, 104, 112, 170, 120, 77, 123, 42, 124, 87, 78, 141, 88, 179, 101, 109, 98, 112, 117, 133, 92, 153, 158, 126, 68, 134, 114, 93, 99, 116, 156, 139, 80, 113, 156, 61, 132, 104, 190, 90, 68, 161, 132, 100, 192, 123, 181, 212, 215, 136, 183, 117, 93, 89, 157, 102, 146, 93, 111, 146, 164, 162, 135, 165, 167, 116, 146, 130, 79, 114, 165, 111, 174, 150, 200, 89, 105, 156, 161, 87, 68, 149, 112, 100, 93, 176, 89, 131, 137, 143, 65, 71, 155, 105, 177, 163, 171, 139, 163, 173, 122, 117, 99, 50, 124, 125, 52, 180, 91, 125, 139, 115, 129, 117, 90, 107, 127, 90, 119, 142, 164, 108, 107, 117, 173, 166, 165, 240, 91, 118, 149, 77, 177, 83, 186, 73, 120, 103, 131, 147, 86, 152, 113, 169, 155, 146, 182, 153, 98, 14, 126, 89, 104, 95, 100, 109, 47, 58, 87, 42, 152, 64, 108, 148, 144, 143, 157, 166, 230, 199, 132, 155, 176, 101, 59, 98, 127, 181, 131, 113, 119, 34, 86, 157, 76, 168, 174, 153, 159, 144, 78, 149, 123, 133, 69, 102, 147, 69, 142, 6, 149, 133, 128, 107, 101, 192, 137, 165, 87, 162, 80, 169, 147, 205, 103, 93, 84, 148, 71, 147, 131, 81, 103, 160, 64, 151, 57, 133, 113, 178, 104, 115, 154, 149, 115, 131, 198, 117, 116, 141, 84, 132, 175, 143, 131, 180, 136, 184, 143, 165, 59, 157, 208, 95]
3422I5NJ5Pm0M9m0qM4J3M1j0N2r6NN4l1m1k8J32l2j38O1k0O8j4k4M9o8Q2Pm4mmL5k3j0L7m3
3460A33L6N4j04K8j4n0L6n8J42m8J2l9j03J22j8M8j8J7M4j02N4q1L1PLnkM0k6J2o7L1M1O4
3494B20r9%p3K3O8l3l3Q4J0o9l4M9l8M1J4K1k9K1mn8Q8k4n1O5j1L1o1j9QJ0J7q6l8J03l3O3
3530A43j01J32m2j0l3M9N3k2On2L9q3J09j07K5J2M7o0K5k0L6r4R6j1l0m3R8o0L6l0J5K9jl0
3564A21j3j5J27l9n6J1L5q4kL4n3P9l7M5N7q3M6J4o5M7m8LN6l1m8L5M1qm9L6l8l0J08j0q2
3599A04Q2l4l9K8L0m1qM5k4l0J3M3Op3L1L4k8l2QJ2L2ql4P1q6K8o6M6N2o1J3l8M5J6l4Pk2
3636H8Nj6P6o7M8J9q1Q6k2J6J1q6L5L0nK3n7J4O1q8L6M1q5R5o4Q4o5%K3l5kM8j25Q3n1M1k8
3673H6L7m4Q6n0k8L4j4O5r6P8p6M7k5j6N8qJ7j2K0l7Q7j32Q7qq5K8j8O8K4J7q2j2O4%j07J19
$$ y = [95, 100, 115, 122, 82, 131, 91, 83, 127, 140, 181, 171, 223, 127, 132, 186, 155, 114, 86, 218, 186, 48, 109, 89, 157, 143, 119, 168, 100, 182, 189, 145, 141, 137, 172, 149, 139, 176, 133, 169, 223, 119, 147, 133, 83, 119, 61, 203, 155, 167, 128, 25, 147, 129, 177, 159, 176, 220, 118, 172, 91, 122, 129, 132, 127, 125, 165, 139, 151, 84, 115, 156, 220, 121, 121, 48, 71, 139, 106, 73, 157, 167, 98, 64, 113, 75, 116, 130, 151, 122, 143, 139, 81, 169, 145, 94, 159, 148, 179, 118, 99, 107, 117, 134, 48, 10, 113, 80, 143, 42, 174, 132, 122, 89, 138, 191, 169, 175, 123, 162, 79, 188, 81, 106, 118, 165, 105, 130, 110, 146, 52, 148, 137, 107, 64, 162, 102, 138, 108, 123, 152, 151, 121, 108, 93, 220, 181, 125, 136, 171, 87, 85, 119, 66, 145, 108, 153, 210, 127, 173, 187, 122, 169, 121, 124, 180, 149, 101, 136, 177, 169, 120, 156, 118, 88, 196, 186, 104, 186, 152, 113, 141, 171, 130, 122, 167, 143, 113, 126, 169, 175, 102, 133, 167, 139, 107, 115, 127, 159, 151, 117, 188, 102, 130, 64, 110, 162, 101, 114, 76, 121, 137, 103, 110, 88, 93, 77, 153, 86, 134, 153, 72, 158, 136, 152, 163, 77, 112, 142, 137, 160, 103, 117, 178, 90, 126, 167, 82, 177, 113, 197, 132, 132, 155, 120, 118, 166, 41, 124, 73, 114, 86, 123, 79, 165, 115, 87, 121, 107, 172, 76, 154, 78, 125, 100, 84, 142, 134, 151, 139, 159, 122, 209, 77, 164, 156, 71, 99, 81, 149, 173, 190, 108, 96, 160, 160, 53, 172]
3709A72l8o8J04n8oN8n3PRO3k9n3J2K4o3qQ5on4L4K0nk4m9O4J0k9k1P9j0n2L3j8j2k1K5N2
3746A74l4J0j9J0m0k4k9R1k5O5p4J5k9Q8n0J0M9j10O6p9J01n8K7J4p2J8kL1NJ7n8J5K9K5n1
3781A06j8L3J7j5O1o1QJ3L7p2Jn2M7J8K7kQk8J4J1l3m9j8R1p0J34q3N5o4p6J50o8l2J2L0K8
3817A60k3l1MN1l1J1m7J8j0Pl7j2P8M5j2m7qQ8j16L3m0N8m4K5j3R9p0J6ko1N9J0m9qM1N8o7
3854A33J0q6J9K7N3k8N2n0o6pQ0o9mO2J6Op1Q7m2J3j1L2o9M4LO1o8J1o4M2P6j9r9M2K3J8j
3891A56om3rJ8o1RO5%j3J04j10m9L4jQ0n7J8j3L5o5J5M5j5jm8Q3k8J7Kj3K1o1p1J43k9o6l3
3928E3P0J6p2J04nj6m0K4M2l2k8Jj3J4M2k3j1M3n5J7j9jnMj3L7K3j8j1n1nL7kj2O2p9P0k5
3966A23kK4n7R8o5rLk2Q0n3qJ9L5q0j0L6RM0l2NM2p5J2k3O8k0j7k1k7N7k6N0K1k2M2r2LMo2
$$ y = [172, 134, 66, 170, 112, 106, 164, 111, 118, 127, 190, 161, 108, 120, 144, 81, 73, 158, 152, 98, 132, 152, 147, 123, 74, 138, 148, 119, 98, 177, 167, 115, 148, 130, 118, 97, 122, 174, 140, 150, 131, 141, 101, 77, 48, 139, 114, 179, 105, 120, 91, 179, 129, 139, 188, 78, 144, 65, 166, 108, 135, 149, 77, 95, 93, 124, 129, 146, 88, 103, 132, 157, 106, 88, 121, 138, 123, 184, 123, 131, 144, 181, 109, 110, 58, 105, 123, 150, 148, 156, 128, 142, 153, 120, 71, 53, 144, 74, 208, 125, 180, 116, 40, 190, 122, 90, 102, 132, 160, 137, 106, 110, 161, 130, 141, 94, 112, 102, 109, 72, 60, 138, 183, 171, 124, 116, 204, 88, 121, 81, 139, 95, 120, 107, 206, 136, 152, 150, 89, 148, 158, 109, 101, 142, 200, 133, 143, 57, 76, 103, 156, 128, 180, 130, 64, 57, 137, 68, 64, 126, 142, 148, 77, 164, 122, 135, 124, 156, 87, 131, 134, 195, 127, 138, 74, 116, 192, 173, 74, 116, 139, 157, 156, 150, 107, 98, 116, 55, 64, 129, 129, 116, 220, 110, 61, 95, 94, 174, 117, 135, 122, 157, 92, 107, 152, 137, 136, 88, 171, 143, 160, 162, 149, 170, 109, 38, 181, 152, 86, 53, 123, 139, 67, 171, 166, 150, 110, 134, 176, 144, 116, 117, 104, 118, 160, 137, 126, 169, 114, 131, 112, 111, 106, 110, 97, 134, 157, 139, 128, 77, 72, 109, 107, 95, 157, 78, 148, 123, 121, 145, 88, 186, 121, 112, 115, 93, 173, 120, 112, 131, 166, 86, 76, 112, 121, 161, 129, 134, 176, 101, 113, 90, 158, 138, 121, 100, 73, 130, 104, 154, 175, 153, 195, 103, 106, 110, 48]
4005D8Q7Mj4N1o6Q1j00j9Q0l3j1J9m4N5k6j6O8K0j10P3j0l0j4K2l1Q9o2RL2l1P6o2N2k6o3
4040I8O5n7R3l8p8O9J7q7R1j05n6J16L5k2O4p8L1r3Q5N5m1j28R6J6j08N2N2n5N2m1k7P2m3
4073A02N3k1n0K8L4j7l0M6j00N3L9o6N0RnjP4j10O5q5O6m6L6J3%om7R0k9p7O4M7p0O3r9l9
4109C4P3O8m5j5l7O3K4k1JJ7r4Q3mj1K1Rpj10N3J9k9l7L8L1L4j07J7J16j2o2j9K3K5k6N8o0
4145A11M7m9l9L8K4KOp5J24p4K9n1O3pqm4R0l2Jl5J1Mk0Jj5L0l4N7J1J7j13O0J9mK2j02J3
4182G8P2r4P3jj4p6J41j9Ro8N0n7l8Q0l2K9l8N7j0n6qQ0n3L9K9r9l6M6M3k2J22j11O1r6P0
4217A51o4L4K2j2M3p8lj0Q2o8M4j7l9O3m2J0L0j4L6k1k8j4j9P2k5l7P3k0n0j3RK0n5JN8m4
4253G5L7L0m7K9lk4K4K9m1K3LN1kk5o9K9M3p0Ql9Q2k3j0L6L9o9L9K4K8r6P0jq7L5Jm4K6JQ
$$ y = [48, 135, 139, 125, 176, 110, 191, 91, 72, 152, 119, 108, 127, 83, 138, 112, 96, 164, 184, 74, 147, 137, 107, 93, 115, 84, 173, 111, 120, 152, 121, 197, 135, 187, 161, 98, 163, 106, 199, 161, 83, 152, 169, 82, 173, 68, 12, 128, 163, 141, 205, 127, 158, 65, 150, 205, 164, 36, 132, 148, 40, 92, 144, 89, 141, 100, 73, 145, 102, 155, 134, 84, 112, 146, 129, 99, 145, 45, 98, 137, 71, 121, 130, 125, 124, 198, 88, 153, 68, 134, 88, 124, 137, 137, 131, 84, 174, 145, 68, 132, 179, 109, 172, 73, 34, 107, 175, 130, 115, 78, 141, 165, 144, 145, 162, 68, 151, 147, 136, 157, 166, 159, 49, 102, 121, 92, 55, 93, 124, 158, 51, 68, 184, 172, 110, 91, 114, 139, 113, 171, 111, 158, 109, 70, 108, 132, 134, 140, 65, 189, 115, 144, 93, 156, 149, 141, 97, 187, 155, 156, 121, 132, 136, 116, 117, 102, 132, 98, 155, 166, 183, 70, 130, 149, 145, 167, 65, 78, 150, 56, 129, 128, 114, 38, 179, 160, 169, 101, 151, 94, 56, 136, 104, 133, 95, 152, 142, 86, 78, 158, 105, 144, 173, 74, 38, 84, 127, 105, 227, 116, 177, 81, 151, 87, 121, 143, 131, 174, 96, 93, 83, 165, 97, 141, 124, 85, 148, 106, 116, 146, 132, 168, 147, 119, 105, 86, 158, 133, 96, 169, 149, 99, 86, 95, 115, 60, 61, 119, 75, 112, 142, 95, 124, 121, 97, 121, 150, 109, 132, 135, 186, 184, 159, 90, 119, 162, 92, 100, 61, 143, 120, 110, 146, 185, 116, 155, 179, 207, 111, 181, 180, 93, 128, 129, 85, 111, 112, 120]
4292A20k6M2O8k7l9m2pL6rL6k1J1k9K0L9o6J7%Qj8K7Kk1J7L2q4J13j04K9K1n3l4J09p4O5l6
4328A22p3R3r1L2l6R8k1P5p3m2J5J09r9L0K3l6k0qJ3%j4J05q5J5J0l5K3M8j04Q2p8Pj7M5m3
4363G0K7L8J2m4P2j3j6Mk1L3j1n2K4Pl4K0K1J0j7l8mL8J8n3L8K0L5m0K9j19M2J15j21k5O3
4398A28qj1K4j9l9QK4M4j9Kjl1R2Kl9j2l0L9Qj6L4q7O5m5j3K8n8J07l5j9k8N2Rq0R8p8J0L2
4436A38Mn3LpL1l3O0L3o6P3j9p4P4l3J1r7P9pK7m2P6p2M2K5p7RM0j2m8P0l8Pm6L0K6j2rO7
4474A80q7J8l7J55j41R7q6NL0N1m9L6p9J4L0kPK0k7jj9ll6M9J5M2Jj65J30k1Q3p5j0L5p7%
4510H3R2j11J16l7k7m3N7j1J7Q4p4L3n1l9M6p7K9J00j14J00q9M1K3l7n0J79j34M6K6j49J44
4541A73j04R0m9Pn9K0K9N5r3mR1o0O8m2J3n8j7O2N0n0l2K5j4qLNK3o2R7J4m8k5K2l1Q4r5M2
$$ y = [120, 94, 136, 204, 177, 138, 96, 89, 125, 116, 152, 131, 142, 113, 133, 172, 106, 123, 123, 131, 113, 140, 142, 121, 138, 170, 86, 199, 95, 124, 145, 92, 58, 167, 93, 158, 122, 49, 142, 51, 83, 47, 145, 124, 199, 126, 84, 99, 208, 109, 139, 162, 126, 106, 98, 111, 111, 97, 202, 117, 132, 142, 107, 130, 178, 74, 156, 78, 85, 68, 113, 70, 97, 135, 147, 103, 175, 162, 146, 150, 129, 162, 151, 99, 123, 130, 96, 116, 137, 147, 130, 92, 88, 126, 144, 91, 129, 149, 184, 144, 173, 54, 96, 211, 90, 65, 128, 120, 109, 133, 114, 75, 83, 107, 151, 132, 134, 133, 102, 194, 196, 157, 145, 115, 154, 162, 146, 180, 93, 158, 113, 100, 128, 70, 177, 142, 123, 95, 147, 156, 76, 174, 96, 106, 138, 142, 89, 92, 85, 116, 83, 143, 176, 110, 183, 164, 90, 164, 131, 142, 45, 124, 117, 144, 102, 178, 106, 148, 173, 96, 105, 145, 133, 85, 155, 117, 124, 78, 108, 134, 122, 113, 180, 93, 111, 74, 229, 88, 185, 99, 104, 134, 185, 136, 172, 93, 107, 137, 135, 142, 162, 135, 134, 115, 112, 76, 125, 140, 182, 183, 18, 148, 127, 210, 135, 125, 160, 83, 83, 175, 64, 180, 143, 116, 73, 130, 119, 136, 220, 146, 179, 128, 89, 135, 58, 87, 187, 73, 173, 84, 125, 148, 111, 61, 240, 106, 152, 178, 29, 173, 69, 159, 110, 117, 58, 78, 107, 162, 69, 65, 156, 96, 164, 122, 135, 77, 60, 122, 172, 122, 90, 115, 101, 93, 96, 101, 124, 62, 159, 173, 125, 100, 122, 91, 175, 80, 122]
4578A22o7L8L5j3o4Q9k1l3joJ02k5m3rK3Rk4q0O6O4k8N4q8m1Q6nq8K0J46j68M7k6N9n0N1M8
4614A79n7K0Qk3l0L9J0J8Oj30P1l7O2j9oK0L3Jk5j3o9Q6q7P1N4n8pKk5K4Rj3pM8Pl3jn2P3
4653A49pk8K5o5L4J3O7m7o4L6K7l2Rm6P4rq7J16q4O2l8M0K4pk6k8L9k7J7%n8J19r0ljK6l8
4690I2P9m4k0j1N5L3%q4K6m8N0k4KJ5M7o7ON3n0N2o1J32j00L0Qp6k8M6K9k8J4L8j24J3J11
4725A66m4J5m4N0n6R8l5qn7k4L2NL2n3K6M9Nn8L1M2n9J6M7q1n0N7J3jL2K5l5M2m0n5l9PJ17
4762A68k4j2nl2j3J03n4n6N6l9P5n4j1%L0p1J6J0P0l9J1Qn5kQM6l2L7j08J34l2%n8N0Q6q4
4798A27m3N6J4k1n9O4P1p1J7n7R6j4m8J7M6j18L2L7K8q0j5R4m4N6n8p9J04o1K4K9k9J3J7L6
4832A81p3JPO5m3j1m0P0Mq3K5kJ2M1n0Rj6N3Jo3j1M3K4j01Q2L5n1J1k3lP9J2m9q0N1nL4Mk5
$$ y = [122, 55, 93, 128, 115, 51, 140, 119, 86, 85, 79, 181, 156, 113, 104, 127, 136, 112, 32, 98, 162, 134, 188, 100, 59, 145, 140, 52, 72, 218, 50, 97, 71, 130, 80, 131, 179, 122, 142, 150, 127, 97, 136, 146, 164, 170, 40, 111, 74, 136, 117, 111, 131, 164, 165, 140, 127, 58, 144, 57, 128, 182, 124, 117, 119, 94, 118, 127, 114, 107, 155, 162, 129, 128, 76, 149, 142, 114, 139, 74, 108, 121, 188, 141, 77, 113, 140, 108, 117, 71, 145, 136, 49, 165, 81, 143, 105, 145, 169, 162, 136, 108, 147, 120, 137, 137, 79, 198, 108, 105, 104, 130, 92, 171, 127, 107, 96, 151, 184, 184, 100, 126, 78, 128, 104, 106, 121, 168, 101, 107, 160, 110, 162, 101, 233, 133, 163, 171, 95, 67, 113, 142, 114, 128, 166, 42, 55, 166, 122, 137, 93, 143, 87, 185, 150, 142, 85, 61, 93, 98, 130, 77, 103, 152, 157, 99, 130, 172, 113, 129, 176, 95, 45, 102, 115, 114, 146, 171, 136, 178, 138, 83, 44, 51, 168, 144, 132, 127, 95, 82, 185, 131, 75, 131, 92, 167, 113, 102, 102, 132, 61, 77, 87, 157, 118, 129, 137, 82, 80, 88, 134, 102, 139, 31, 165, 133, 133, 75, 125, 211, 127, 84, 140, 154, 133, 74, 138, 209, 138, 155, 98, 194, 180, 132, 149, 195, 77, 109, 146, 174, 94, 79, 173, 129, 185, 127, 48, 152, 91, 115, 144, 115, 128, 145, 181, 108, 109, 116, 181, 138, 127, 87, 157, 161, 78, 103, 101, 113, 154, 104, 113, 97, 150, 151, 88, 77, 120, 144, 43, 125, 160, 109, 120, 97, 94, 173, 185, 136, 56, 107, 102, 136, 140, 115]
4871A15k3k6J6N0r2J42q6J2J4j6Jj04K06j2p6J0nO6n4j0m5N1mo2O0n2O1j7K1m7O1j01j6Q6
4905A24jk5L4j4L5L1p2Ljj3K1k5M8K6r2J9L9l8K2K0o1J66r1q4M7k0jL1j10R7m3J3J00m9K4
4940A60q0N7J1o7J15p9J4on4J02q4N4M2n6J3j7N7q1m8N2%Q4p9l6J8j1L1K8rj3J7N4m5l3N5
4975A66m7J4j5NKLj9O4j10K9j9O5j1O1r5J5P0o5j1M1j1K6J9o9J3K5k5M3k2m9N9K2m0Q9j24
5010I9M6QM4o5JM0q3J6n5P1%No0L4J00r3PL0M7k2n0l2M0Lp6N5j5O6p5J0JK4J5Pj1k1K6k3j
5049A13K0k2Ll4M0o%M4k6nJ3l4j0k4L4mO3l8JQ3j25m0R4k0k5qN0jj4J3j4M9q8L7L3l2k5L6
5087A31m6J4L8o3J33j23L9J3q7N4j4mM6p6O8j0n6R1l9L9j7l5kPK1L2N0n7k8L3m4MM0NjPm1
5124A22k4J1l8M0RJ7q0R9m9K0m1J2O9J2m4kp4N5N0j11R5J6qj6rkJ6np0K9o%M3mM7j9Ok6q8
$$ y = [115, 92, 66, 82, 132, 40, 182, 96, 108, 122, 106, 107, 3, 209, 197, 121, 131, 126, 192, 138, 128, 83, 134, 130, 68, 128, 76, 137, 120, 141, 94, 155, 54, 38, 124, 123, 98, 132, 118, 153, 184, 112, 115, 114, 101, 122, 97, 145, 171, 79, 98, 137, 99, 121, 141, 80, 246, 155, 71, 118, 98, 97, 128, 18, 115, 72, 85, 185, 136, 160, 80, 137, 148, 81, 196, 117, 131, 125, 71, 173, 89, 143, 185, 129, 142, 125, 182, 101, 53, 105, 105, 189, 110, 74, 92, 81, 112, 140, 131, 118, 135, 189, 144, 111, 166, 119, 133, 118, 123, 125, 128, 109, 173, 63, 92, 73, 138, 127, 188, 93, 108, 178, 113, 102, 143, 132, 158, 177, 108, 121, 146, 121, 164, 142, 93, 152, 174, 134, 223, 99, 145, 153, 197, 132, 133, 173, 90, 106, 51, 122, 122, 127, 67, 101, 201, 108, 115, 145, 192, 170, 120, 88, 128, 131, 55, 110, 95, 161, 86, 96, 97, 121, 136, 143, 132, 111, 137, 114, 113, 133, 111, 114, 80, 120, 114, 114, 158, 132, 127, 140, 106, 96, 72, 106, 102, 165, 127, 128, 211, 86, 46, 140, 120, 95, 87, 137, 136, 122, 135, 121, 170, 82, 119, 152, 120, 95, 131, 85, 99, 137, 74, 207, 84, 123, 136, 49, 103, 89, 85, 131, 55, 123, 113, 57, 148, 109, 148, 131, 96, 94, 101, 122, 154, 204, 147, 119, 152, 108, 112, 152, 157, 156, 163, 122, 98, 109, 71, 111, 120, 137, 57, 156, 107, 127, 86, 98, 167, 179, 135, 133, 59, 114, 164, 53, 148, 164, 156, 140, 131, 129, 145, 140, 70, 99, 93, 93, 136, 132, 179, 160, 166, 140, 52]
5163E2J25n0kk4l4N0K0J0o1k9P3j8L1p7K8L9L2Oom9k7N0m6P3l7K9N5j58N0J0P8n1J2l7j2L8
5199A43l4l8K4K9m1J9N1M8n1o0K9K4L4q2k5O2M7o3m6P8m7J0l0R1p9JO8k8m2K8N4q2r2J60k7
5234A33k5L0p8P3m9M1rn7N9O9r3m6P5l6J14j24L2L8rO4n9j0J2n9Ln5oK5P4J14j12n2J04l7
5268A44p0M2j5K5J7Rn8PJ6J6pon3N6j0mq1Q8k2RK1J4l9K8K0L7o1k9L8j6K2K1l7j5Pj3QlJ0
5307A16L1J0K0o1M6p6J7L2j8K4PPK2m0j6j0l4L6JK5l3lQN9l3k9pj1O4p7Q0k7Qo0j2L0l6K0
5345H0J0L8K1J2Oq5K2nkO9K5j14K1R3r4J7M8l0r8N3P9p5O8o4J21j57N0oL8Oo3Mm8P1qk4O0
5382A39m6J15p9JM4p3O1l8O2j03Q1r8N4P3j06P3o4m8J3Q8j2l1Q6r5L3R2q8O7m7J1M7q3O4l6
5416A57p3N9j7q7Q7k3J8k0O3o5jJ2M6o6L7J7n5j3%l9Q6m0NMJ15j31L6j5L3N7p1l3k3Q5l0k8
$$ y = [52, 177, 127, 125, 101, 67, 117, 137, 147, 86, 57, 130, 112, 143, 66, 94, 133, 165, 171, 165, 116, 89, 139, 93, 166, 129, 158, 213, 55, 105, 115, 193, 142, 154, 117, 105, 143, 109, 71, 95, 124, 83, 102, 153, 201, 150, 90, 119, 143, 177, 95, 70, 132, 179, 116, 70, 148, 101, 111, 81, 172, 93, 94, 162, 134, 92, 120, 174, 92, 0, 160, 133, 108, 138, 60, 133, 84, 125, 116, 59, 118, 187, 94, 48, 123, 87, 201, 77, 109, 147, 138, 202, 143, 133, 145, 86, 89, 34, 28, 53, 127, 241, 129, 77, 181, 144, 74, 116, 101, 126, 143, 152, 94, 101, 117, 133, 126, 120, 67, 123, 113, 109, 28, 116, 94, 103, 124, 138, 99, 127, 147, 184, 123, 94, 132, 116, 138, 159, 122, 107, 114, 101, 109, 106, 116, 147, 157, 177, 116, 162, 86, 103, 135, 117, 141, 148, 155, 177, 137, 121, 111, 77, 113, 114, 139, 106, 103, 111, 170, 137, 108, 101, 90, 154, 77, 157, 130, 138, 78, 66, 96, 60, 80, 90, 128, 149, 161, 167, 82, 104, 99, 97, 166, 191, 77, 98, 191, 97, 114, 162, 132, 34, 87, 166, 91, 159, 95, 216, 59, 109, 103, 141, 147, 84, 88, 40, 111, 103, 79, 139, 93, 208, 129, 130, 174, 101, 162, 124, 186, 83, 164, 66, 120, 193, 87, 160, 96, 48, 61, 149, 137, 106, 192, 97, 130, 222, 134, 201, 154, 165, 212, 129, 193, 157, 84, 143, 126, 39, 126, 103, 121, 101, 164, 99, 98, 110, 156, 90, 127, 144, 89, 76, 76, 37, 123, 83, 88, 92, 207, 76, 112, 97, 130, 187, 116, 83, 60, 145, 115, 87]
5452H7L7r2P4J8K6n5J0K8l7n1Q6m1J5L5m4Q4n5L7lp5L2pk4pP8m6k8PP4k2K2q4mN0m4P3n0k1
5490H3J3J4J4j3MPo0J21r9J8N5Jp6J7J8l2J2L6L1p6qj9O1J2R0p6n8O4JNn7R2j32PR6k8O8r2
5528A14J1pj3P8o5l6P4o0M1PJn5R6ql8rj8K6K7M7l5m1J0l6j7O1n4J2K1k8K5k6oPK0N9k1jl2
5567A31L6j38J43l4k7jJm5P9j6Lm3K4o1P7l2J3K1L2j09M8N4o2N5L6n7N1r2OK3K7n3L6l4mK7
5603A15R2j06K9l7NN3m0N4r2K4l5O4rJ0j1ok4L9K1j8m9M3k0O9J3q4L3j4n0L5m1P2K8K5p3L2
5639A47o3M0l5M3J9k9j6K2P5o5NKm4Po2J1O9j1N5r5L0O4p3L1KK9k2m8O1Np6k8L9J6K7l3Ml9
5677F4N5oO7j04K5Jj6NO1L9j8o6k0Q9p6j3P0m5J5j3n6O5m3Q8n8p8P8M1m9J4k4N1n9Q0l2N0
5713A82k9j17Q3NJj4L0J9L2l4Km5J0K6k0N1j34P3M3o2o4R1l9P0j0p5L6L1l8rM1k7j07J84l2
$$ y = [87, 124, 32, 106, 124, 150, 95, 105, 133, 96, 45, 131, 90, 105, 140, 96, 180, 125, 162, 159, 84, 116, 109, 85, 78, 156, 110, 82, 89, 163, 141, 163, 79, 75, 125, 81, 154, 104, 83, 96, 110, 124, 111, 115, 122, 62, 183, 84, 102, 157, 158, 82, 99, 117, 85, 97, 133, 164, 88, 80, 61, 122, 134, 224, 148, 90, 154, 155, 160, 103, 195, 63, 70, 166, 138, 206, 114, 125, 118, 105, 183, 118, 82, 156, 96, 137, 144, 145, 90, 186, 178, 140, 131, 113, 139, 166, 213, 178, 137, 147, 111, 94, 155, 101, 113, 134, 106, 131, 105, 99, 106, 126, 185, 164, 163, 131, 167, 29, 172, 138, 111, 110, 111, 66, 145, 129, 132, 89, 113, 52, 129, 97, 110, 131, 163, 54, 102, 156, 94, 149, 185, 128, 179, 87, 93, 116, 143, 90, 126, 92, 88, 115, 207, 101, 130, 93, 98, 151, 111, 165, 73, 97, 62, 126, 117, 127, 116, 110, 86, 125, 146, 128, 79, 122, 102, 171, 184, 100, 133, 119, 69, 104, 63, 135, 163, 188, 115, 147, 84, 124, 89, 132, 151, 122, 106, 128, 203, 138, 143, 145, 101, 108, 46, 57, 126, 115, 170, 75, 105, 169, 96, 127, 129, 158, 136, 88, 149, 154, 78, 50, 89, 105, 132, 99, 103, 64, 119, 113, 180, 76, 101, 102, 86, 91, 152, 191, 173, 107, 87, 176, 100, 87, 157, 112, 127, 114, 58, 123, 80, 168, 110, 32, 110, 151, 102, 116, 92, 143, 84, 164, 132, 182, 153, 36, 119, 124, 125, 111, 141, 160, 192, 158, 160, 115, 125, 151, 131, 182, 48, 121, 164, 102, 38, 129, 90, 160, 150, 75, 111, 142, 104, 95, 136, 109, 2, 186, 154]
5748A54p6j8P6Kl4RJ3l8O6q4R2q0%O4l8O3k3n3K9k3Q3p3p3P2N3p2N1JPk7Q8r7M9Lp9jK4N0
5786A60n7J13p6L5p5J8N0q8O3j3Lm1M9m5K8n3Q5J8J2j32Q1j5ok7j1J0P3m6K0Nj3J8m1Rm7L9
5822A03QM2l3j0k8M4L6n3kqN4j8j03O7m5R4l9j4R1q4J1J2J5q1L7M4j4j0k8L9J1m0NlP3q5n9
5859B9P0N9m4N8m0nJ2m4kO5o9O9m3l7P5o3L0m6k1Q7n6K5kK3L7l4j7j3rM8K4l0l3K2l3m0O4
5896A16m2O4Po9K9m5N1n5M1K4M8J9n1l1j0k8O2l5K0mM1p8P8nrj1j3L2m6J6n0R1p4R3m6Lo1
5933G2P7r2N1m9N4L8m4J3n2M5mK9o1QP0q4P9j06lK4Q8k8J7Ol5j4m0O4N2p4J7KM0q7J1R9n9
5970A24l2J5j7O9J3j26L9O5n0N2m0J0j3l7P3l1o4Q0K1K3r5J7L5mpj1Lk0J1N5MJ1q7j5J6M2
6006A29qo2O6P9j13P5j1Ln6nN5l5L9pn2M9l1p0P2P1j15J0Mj5P0Mk8J3N5q0on6N1L4k2NQ6o9
$$ y = [154, 78, 60, 136, 138, 104, 113, 126, 88, 154, 70, 162, 82, 82, 146, 108, 171, 148, 95, 124, 101, 184, 111, 38, 110, 163, 91, 142, 143, 150, 123, 211, 114, 163, 166, 87, 86, 110, 160, 103, 216, 140, 175, 100, 118, 168, 80, 143, 130, 133, 92, 141, 96, 124, 71, 156, 174, 186, 54, 135, 120, 114, 87, 76, 86, 159, 113, 133, 138, 125, 143, 102, 111, 64, 103, 111, 153, 120, 110, 82, 126, 162, 109, 107, 99, 153, 135, 32, 99, 54, 148, 109, 95, 186, 102, 113, 125, 140, 59, 96, 140, 126, 116, 88, 127, 138, 98, 103, 100, 173, 88, 29, 99, 158, 114, 172, 132, 127, 139, 95, 93, 158, 89, 158, 115, 78, 153, 90, 120, 74, 53, 140, 84, 109, 107, 130, 167, 133, 116, 103, 94, 142, 166, 136, 103, 125, 92, 52, 116, 74, 138, 145, 76, 105, 60, 111, 56, 97, 121, 169, 188, 137, 106, 96, 68, 130, 95, 115, 111, 152, 74, 152, 147, 138, 127, 114, 146, 100, 116, 66, 157, 83, 176, 130, 133, 72, 149, 57, 108, 59, 113, 151, 107, 120, 68, 113, 109, 138, 77, 85, 155, 71, 150, 44, 41, 65, 153, 125, 142, 148, 113, 99, 59, 123, 175, 101, 118, 120, 160, 73, 84, 183, 124, 92, 107, 90, 159, 172, 46, 85, 150, 100, 152, 112, 122, 109, 72, 145, 114, 50, 130, 151, 174, 79, 96, 131, 127, 120, 109, 112, 92, 103, 158, 162, 173, 86, 71, 87, 129, 121, 59, 125, 204, 91, 166, 155, 158, 102, 97, 152, 117, 156, 149, 97, 146, 115, 45, 117, 188, 73, 83, 87, 72, 142, 146, 118, 131, 186, 106, 100, 44, 95, 129, 107, 112, 198, 129]
6044A29j5J8k0P7m1QLm0l6O2j0l7K1l8Q3k7o1M4m9L6N0j6j3Kq2O6oL8jm6M1L2p2O2j4O3j42
6081F9O5KJ5n1O3q3M7n6R8l5m7KQ6o9NR8l2j9K3q1m0N1LQ7p2j2K3L8q6KK1J9R8j08P2k0r1
6118H5M7l2O3q4J04n1r0L7J18j28J7jK2rP3o6%M4k5j2M3o9Rk5R4Nj18R8j50J28l8N1nK4o3
6153I6K2O7j09K7mm3R1K0m9m6P5q1Q7m2Pll8K6P1m8l5L6k5k9Mm4P7J2K1m2J7J0QKJj4o5P3
6191A33o3K2M8j9l8L1J7k0K5k3N7q4Q6j0q7M6Qmj1K0rpK4k5l8L7M0o5L7j7J5j1ok4L4p7O3
6228A05J02j12L2L1p2J7N4m8M6j0M2m2o0qK5k2Q0o1L3K6j24M8o4J25jo7Q5l8J3Mq5J00p8K4
6262A00J6K3oJ2L8m7j5m0jM1k9N1n2K1J7m2K1M2o7M5L7L5p3k2L6m9O4j35J14j4j9N8o9M3m7
6297H7J8LqK6n8J08K8n3k8j8L1l0M7p5M1QK4qo9K1L5p0N7J1m1Q5K4j06JL8qj4K9K8n5Rq0Q0
$$ y = [129, 114, 132, 112, 189, 148, 156, 159, 119, 83, 145, 135, 98, 119, 81, 164, 137, 76, 120, 71, 107, 157, 141, 128, 130, 48, 114, 108, 146, 145, 99, 140, 172, 100, 162, 148, 211, 69, 134, 136, 151, 100, 163, 80, 127, 71, 169, 134, 87, 89, 175, 106, 111, 209, 177, 158, 181, 100, 60, 111, 114, 201, 129, 117, 140, 178, 92, 94, 115, 134, 232, 124, 196, 176, 85, 132, 100, 163, 79, 183, 132, 42, 79, 197, 69, 86, 85, 107, 98, 171, 105, 105, 149, 124, 112, 155, 86, 95, 70, 164, 169, 51, 149, -1, 127, 89, 140, 135, 159, 96, 118, 185, 76, 103, 99, 56, 147, 167, 118, 72, 147, 66, 153, 111, 118, 115, 77, 103, 174, 126, 91, 127, 102, 73, 77, 33, 110, 122, 143, 101, 118, 128, 136, 138, 139, 125, 60, 133, 70, 92, 140, 121, 83, 114, 131, 111, 136, 113, 170, 86, 172, 162, 75, 121, 129, 125, 114, 134, 125, 118, 142, 117, 79, 116, 156, 91, 128, 111, 126, 115, 109, 85, 119, 42, 105, 207, 95, 127, 158, 86, 103, 157, 109, 155, 145, 187, 145, 85, 77, 102, 80, 160, 99, 132, 158, 34, 82, 18, 143, 142, 75, 160, 122, 135, 139, 54, 154, 76, 100, 116, 139, 133, 145, 183, 136, 121, 81, 80, 121, 92, 143, 91, 112, 129, 87, 108, 150, 83, 128, 165, 200, 127, 105, 141, 92, 156, 21, 135, 121, 102, 160, 91, 134, 87, 105, 108, 100, 126, 68, 176, 204, 151, 123, 105, 136, 106, 153, 78, 119, 127, 151, 143, 74, 95, 130, 60, 117, 128, 87, 172, 196, 90, 91, 129, 121, 107, 136, 164, 109, 118, 38, 118]
6335A18pN7l3n6K7l0j2Q4J1l0j0l3N8Po9J8L0km8M9l9M9K8n8o3M7j7L6K4J9o7K5k2P1l9J2
6371A35l3mQK0P7j31J03p8N6p8lJ14q0JLj3l4R4q0Q2j04P4m6J0K0k9K3oj2J7n4N0K6j8m1J9
6407H8K6M6l6kpp2J01m8L5q0Q3k0l8N6r0L2J3Q9m0R2j25M5k3n3J18r3l8J51j07l9J03o1K7
6440A33P7r6Ono9R9n0NN6l7oK6n2L7N7o4Om1M9L0Jj21R4m1K4l9O4j4L3j8o1N0nPkK7j26J60
6478A94r2L3K9k4K7oqn7Pj4M6j09Q6n5P3J0p7k7P0K9M1r2L4n0P5p0k4k4J36p8j9J05p3L1J5
6513A42no1Q5n5k5j5J2Q6q7L4kJ8m2J11q8N0m6P6l7l1K4jm1n2P0M1j01M6m9Kj3O7j2L4o5J7
6549H7N2k8L9p5N5kM1m3Lk7j5R6j46K1L1L7l9j9P2prK1mp0K6j6O0n5M0j4K9lj5m1j5N2LM9
6587A71p7N6Nq4M7l0K6j9j0K2K1%M7r8O8o4M6j2j0Ql2L6j4L7k6L2m4k6J0M6%n2O1p7N9M9R
$$ y = [118, 111, 168, 135, 79, 106, 76, 64, 148, 159, 129, 119, 86, 144, 151, 82, 100, 130, 128, 80, 129, 90, 139, 167, 109, 46, 93, 76, 112, 136, 155, 88, 113, 91, 162, 123, 135, 102, 98, 106, 126, 203, 72, 175, 97, 153, 75, 72, 186, 106, 107, 110, 97, 63, 157, 77, 159, 55, 129, 83, 93, 113, 84, 107, 101, 89, 106, 52, 102, 128, 110, 69, 88, 114, 160, 124, 122, 115, 43, 144, 96, 131, 51, 134, 114, 76, 132, 42, 74, 87, 176, 136, 228, 103, 148, 125, 72, 190, 97, 59, 210, 103, 64, 167, 106, 133, 210, 114, 120, 115, 46, 145, 95, 100, 156, 119, 113, 139, 87, 124, 181, 117, 123, 82, 131, 161, 162, 41, 135, 94, 118, 79, 143, 129, 162, 144, 83, 133, 128, 135, 133, 160, 34, 194, 102, 135, 164, 140, 167, 161, 153, 96, 103, 89, 135, 26, 112, 57, 130, 140, 63, 36, 106, 135, 176, 84, 118, 68, 143, 73, 49, 25, 161, 83, 64, 169, 96, 127, 142, 137, 76, 161, 106, 81, 66, 78, 164, 77, 111, 109, 127, 85, 196, 108, 158, 112, 188, 151, 120, 144, 143, 102, 50, 120, 161, 60, 106, 57, 59, 46, 113, 101, 135, 70, 87, 139, 111, 150, 75, 130, 128, 169, 126, 129, 102, 87, 183, 37, 58, 89, 126, 87, 68, 140, 133, 124, 145, 141, 71, 97, 81, 141, 86, 126, 112, 141, 138, 123, 82, 67, 119, 122, 171, 94, 150, 155, 71, 118, 88, 114, 95, 85, 107, 128, 128, 175, 77, 145, 81, 127, 115, 105, 113, 81, 117, 103, 140, 114, 146, 102, 76, 86, 132, 132, 80, 141, 64, 123, 172, 181]
6624A81k4NKn1L3n6Qm0Q8n9J3N2k7k8PP3j13Q1o0K4m5k0R2K1j02O9K8j1j3mMn1Q3o1N2nlk7
6662A16K2J5j7L3n2M2p1M5k1j8J9j5M8j7L3p0p6J28m4o7O0K6K8j17J45j43P3J9n8L1M6Ok4
6695A25Pl5J4j4J01p9Rq4O3mlk7O6jJ7l2Mo1N7N7j03J0L4Pm7N6ook5R4l4p8L7l6k4O5n4L3
6733A03M7k7o1K6j8R5o5pL5n5Q7or6O9n8L0M2p3R1j2n5K3J5P8j30O6O3j44O3p2N0L4M1k3l5
6768A21o7J8N6K6mj16J38n1Lp3L8L7k0O1q1Oj4O6l2j6J2M0%K0l6%j0l8m1Q2m9L3l6J03q8Q8
6804A76k9p4M9j8N2n4j5P1p5l8J07k0r6J31k1k9LN4o1K0Nn4R6j5j46J15o7O2l6l7O2pnP1p6
6839A01K3J5J1K8p2p5N1L9m0P0k5rM3q7nJ3N4m3P4j12J7j1P7J4K5o9J3k3j9j6L3l8R6n9K6
6874A20L2k3N3p3L9j6k8L6lJ6l6L5k9j9N4jo0M6k2j4N3m6jp6J12K6J4j8m6j4M1n7Q6n9Rl5
$$ y = [181, 157, 162, 164, 113, 146, 90, 98, 58, 146, 87, 100, 152, 125, 97, 104, 177, 64, 145, 85, 109, 64, 44, 136, 157, 55, 124, 152, 141, 128, 124, 128, 77, 160, 99, 151, 146, 143, 116, 138, 153, 136, 169, 117, 159, 88, 133, 112, 94, 113, 98, 146, 129, 162, 92, 16, 144, 100, 33, 93, 119, 147, 30, 175, 32, 105, 124, 66, 97, 143, 149, 125, 132, 97, 111, 97, 198, 119, 128, 44, 107, 103, 100, 73, 139, 138, 155, 123, 127, 66, 123, 180, 77, 87, 121, 128, 81, 137, 131, 125, 100, 194, 160, 82, 119, 83, 59, 124, 70, 103, 150, 123, 62, 88, 70, 165, 100, 93, 128, 73, 160, 154, 58, 127, 69, 99, 141, 68, 159, 147, 92, 115, 130, 208, 78, 144, 207, 63, 126, 54, 104, 138, 179, 156, 121, 54, 72, 128, 154, 150, 34, 172, 121, 124, 51, 89, 126, 106, 167, 86, 92, 78, 144, 112, 96, 108, 148, 148, 168, 132, 132, 122, 84, 43, 125, 76, 109, 73, 176, 88, 176, 147, 73, 122, 104, 156, 102, 87, 158, 83, 45, 152, 132, 36, 167, 146, 117, 120, 174, 113, 133, 138, 84, 180, 165, 19, 134, 67, 129, 93, 56, 118, 111, 106, 177, 101, 124, 139, 150, 178, 106, 31, 82, 121, 81, 151, 126, 117, 160, 73, 68, 81, 135, 92, 166, 54, 71, 60, 137, 151, 176, 107, 120, 97, 78, 62, 95, 57, 153, 94, 120, 152, 129, 182, 109, 148, 132, 104, 140, 137, 153, 117, 152, 123, 104, 158, 157, 97, 143, 121, 107, 160, 114, 113, 37, 149, 175, 189, 171, 125, 111, 152, 95, 181, 122, 131, 96]
6910I6N6q7J4M1rK7n3OP6l4PJ4n7j7Ol2L3P9j04M7l0NL4j01J20j9Ql8Q6o0JN5m6M6l4L2j12
6947E6M7L8ln0j4j5j6K9K4jL0rJ0n5P0l8j4NLM0pk7N3m5N5oL2j55N2M9nLk6k7m1J46j4j20
6985E4J47j39J51q9PK0j3k6m4LK7p9J27k1O8j03K7L4l3J9M8k0j05N5l6KN5n4J02p3K3p5L4
7018I3M6l6M9m3N5l3J5k8K0l1J3Lp1J39n8j34J52k4Rr5J05o1O9m5M3n7jKL1m3Jm5QL8P4l6
7054A24o3J14j73Q1N7k8m5J7N6q6J03k4K9j06J08q2O0j6L9n6L7j3J9Jl1M3r2M5o0R3n4J0L2
7087A39Rk8k5R9r4K2L8n2n5Q1n8O5k8NMp2R1j7l7mk9P4k7O5j8J7q2k7O8M0q7R3l1n2O4o0M0
7124A31J0k5N6r9O2l1K7l5J3J7j2j0K2J7Qj01P6mn7Q4j09M7k9R8k5k8M8n4j4J3n3J11m1n2
7158F1P2ll4O5m8OL3r4J41j40P9n0P5p2J09n2l6L3nO3j22Q9k9o3L3K0J8p7j8R9o8P0mj3m5
$$ y = [96, 152, 65, 79, 120, 111, 138, 85, 91, 167, 133, 140, 154, 97, 80, 86, 54, 87, 166, 62, 109, 79, 84, 118, 17, 137, 118, 126, 88, 174, 114, 115, 170, 124, 170, 136, 168, 56, 103, 141, 138, 88, 74, 59, 43, 72, 96, 95, 125, 116, 126, 71, 141, 103, 89, 94, 97, 137, 130, 103, 156, 111, 166, 160, 192, 37, 89, 138, 133, 136, 110, 83, 42, 188, 174, 54, 201, 62, 213, 124, 131, 151, 138, 112, 68, 71, 98, 19, 146, 125, 193, 90, 117, 151, 118, 137, 185, 165, 60, 115, 79, 81, 136, 82, 184, 111, 134, 59, 93, 139, 103, 152, 109, 164, 131, 146, 118, 138, 107, 120, 123, 52, 191, 133, -1, 151, 127, 136, 41, 146, 85, 154, 109, 152, 95, 94, 96, 127, 84, 85, 40, 48, 86, 160, 124, 61, 175, 2, 83, 140, 112, 67, 84, 140, 54, 157, 133, 162, 56, 164, 82, 142, 126, 165, 109, 146, 133, 152, 153, 122, 165, 73, 118, 58, 151, 97, 107, 139, 148, 120, 95, 194, 100, 122, 160, 108, 53, 134, 76, 141, 113, 118, 122, 50, 141, 124, 87, 83, 54, 128, 101, 166, 148, 165, 83, 56, 124, 164, 77, 170, 139, 87, 151, 91, 131, 141, 116, 172, 73, 135, 104, 131, 96, 109, 126, 114, 104, 126, 143, 151, 50, 126, 122, 65, 149, 40, 87, 58, 156, 131, 103, 151, 97, 83, 96, 43, 154, 113, 61, 133, 130, 96, 161, 113, 119, 152, 58, 199, 59, 138, 88, 163, 91, 200, 148, 112, 145, 140, 203, 81, 170, 141, 78, 111, 131, 149, 72, 54, 153, 85, 155, 151, 138, 93]
7193I3n5O5j5N6r6R2j9L8j01O1K2j3j3l1O7k5K3m6J1m9M2J6k1p2J07m8N3j04O8nPkK4pl5K9
7229A17l0K0J5J8k6J8m3Rj9N3n6l3P4j8J4k1J1O6o2mn0J11m7J6K6n0L5l9M1j04Q3P5j06K8
7263A22J4oJ8k7Rl1N1o4L6l2j7M0j3pM9K2m9k6O8nj8J5r0K1N7k3p1J23l3L5m3J2p8O5Nk6K2
7300A25j2N6k6m9j7j2NpM4j1L8l4N4k0J0NNmNl6j8pJL3m3k5P5l9JP7n8nRlJ8n0O7j7n1n5N0
7341G9kK4P3n8J0p9J08n2j0L7m1N3l4jKK4l5K6j9K9j08J51j11NL1K9J2l5p0L4O8jJ1j0Q1o0
7377A61l2o0pJ03r9M8o1J16nm5M2j35Q3RJ7n6J6M4r9Q3J2q4P1q7J29q8P5j7k3m0O1m7m8P5
7411A12N1n4m4R3m7%N1k0O4j42R9q2J4jK5m4L5K9n1O3r8Q6q0N5M5m6nM2j2K0Lrm1K6L6l3m0
7448A00K4n8Q0l9R1pj4o2jm1P6p5N8j03R3M3j12R9q8J03n2j6n7R1J0rJn1O1k7m3K4O9q0P6
$$ y = [93, 38, 103, 88, 144, 48, 140, 121, 159, 58, 119, 141, 128, 115, 84, 151, 126, 149, 103, 114, 65, 107, 123, 102, 30, 137, 89, 142, 38, 106, 101, 108, 106, 130, 123, 88, 117, 87, 107, 122, 140, 114, 132, 89, 98, 79, 132, 76, 43, 117, 99, 113, 92, 103, 169, 107, 103, 53, 164, 117, 133, 159, 109, 144, 105, 146, 42, 125, 200, 94, 122, 136, 130, 148, 121, 130, 99, 150, 86, 122, 90, 73, 113, 100, 93, 142, 164, 115, 89, 157, 152, 134, 149, 59, 80, 137, 114, 43, 166, 133, 168, 125, 137, 59, 124, 129, 103, 125, 113, 169, 143, 94, 77, 65, 70, 63, 107, 96, 134, 100, 154, 134, 144, 149, 154, 150, 155, 119, 101, 94, 95, 128, 85, 60, 135, 96, 97, 174, 116, 111, 120, 117, 135, 85, 152, 135, 84, 29, 79, 77, 101, 174, 116, 126, 47, 155, 103, 93, 130, 89, 142, 108, 107, 109, 133, 98, 124, 105, 134, 26, 177, 66, 71, 102, 131, 143, 108, 38, 72, 140, 139, 150, 140, 221, 161, 129, 69, 62, 165, 66, 114, 53, 169, 164, 119, 161, 26, 109, 118, 135, 79, 95, 139, 40, 123, 135, 51, 122, 35, 164, 76, 151, 134, 111, 71, 132, 85, 37, 112, 163, 109, 65, 158, 111, 111, 162, 142, 206, 64, 163, 81, 95, 94, 119, 75, 110, 139, 88, 151, 53, 139, 59, 114, 159, 113, 108, 150, 138, 158, 161, 152, 111, 137, 173, 140, 100, 124, 66, 146, 107, 198, 191, 177, 115, 114, 73, 149, 74, 132, 29, 122, 165, 53, 152, 64, 167, 115, 99, 42, 133, 143, 134, 135, 84, 145, 118, 75, 99, 168, 88, 164]
7483A64l6ORl3K3kl0N8oq2P5k7J0oL1j3k9M6j3m0N1q2LM7k5o1J21r6R8J7J7m0ol9L9l8j6J8
7521A13P7r5l4N8r9P3M2o8O8L0j7p6N9j9L1o4K3JL9m0M7krL5j05P1n1RM1o3J29j33M6o0O0
7556A17L6o2n1P2L0pJ5Rk1j3l4jP3n5J10j17k6Q3kj32J14o9P0n1j7J9K5k3N2nm9N2r1N4j1
7591I4L8m0K2m6J25q2OK8o3N4lk9k3Q4l4l1m9M7N7m8P4j38O9N7k3m5K3Ppk6k0K8Q6j52J05
7626A45Nk1o9M5l7J8R7j51N3l7N8M6j4m3K0M6j3n5KM2p0L5k5jQ1JK0k2l7O8q1jm0L9M8l9m0
7663G3K7L1q1M6OrN0r5K1o5P5PP5n2k8J6Q6n5p5M8n4lP0l4PM1k3rm7J9K1k8N9M7j39J63q4
7700A07Q1o7RM3n9jp4J15p1O9lrJ5r1Q7o0j6J07m8o0N2k2L4J5K2q8QM1l4qLK1L3l2km0J00
7737A77k3J3j0j16N6q0K7J02n5j0N9k5j8l0J9L1o3j2QM6l9O7nJ5kl9O5j03P4q3Q6J3j04J39
$$ y = [164, 128, 134, 143, 110, 133, 131, 101, 159, 153, 71, 146, 119, 129, 123, 154, 141, 112, 158, 145, 105, 156, 74, 77, 124, 99, 38, 159, 63, 161, 178, 195, 155, 149, 110, 149, 111, 95, 113, 190, 95, 61, 119, 20, 93, 135, 67, 135, 165, 148, 72, 131, 112, 143, 79, 102, 103, 142, 102, 149, 147, 138, 173, 68, 139, 88, 97, 138, 75, 204, 71, 117, 57, 117, 153, 91, 40, 112, 142, 135, 150, 159, 138, 125, 91, 90, 163, 108, 218, 101, 75, 158, 156, 24, 138, 69, 139, 88, 71, 90, 115, 92, 144, 139, 90, 142, 51, 105, 94, 132, 92, 114, 68, 193, 111, 117, 145, 82, 136, 133, 104, 81, 165, 131, 100, 51, 98, 155, 107, 181, 43, 112, 169, 146, 101, 124, 131, 124, 98, 78, 106, 192, 40, 145, 150, 129, 60, 105, 68, 86, 183, 32, 85, 48, 106, 152, 138, 95, 115, 161, 148, 93, 95, 137, 67, 102, 77, 76, 157, 158, 178, 156, 119, 187, 106, 105, 65, 104, 152, 113, 73, 100, 131, 50, 96, 102, 93, 143, 48, 69, 4, 79, 86, 161, 109, 81, 97, 183, 128, 53, 101, 47, 44, 114, 80, 87, 128, 105, 96, 49, 68, 89, 61, 120, 167, 28, 191, 107, 188, 121, 130, 173, 114, 113, 39, 154, 83, 152, 149, 140, 155, 64, 151, 91, 75, 182, 134, 74, 126, 104, 138, 153, 175, 87, 95, 136, 102, 94, 97, 118, 151, 119, 117, 77, 177, 154, 167, 157, 41, 97, 17, 44, 146, 91, 81, 140, 115, 97, 67, 86, 117, 54, 42, 50, 96, 57, 124, 119, 134, 132, 93, 158, 55, 129, 46, 132, 145, 41, 180]
7771A80m8m2R6q6J7L2Oj8n4J0L2m4RN3j12J16j13J30l0J2n2o3J17K1l9k2Nj6M1n0J0mr7J65
7805A62k8M3m4l4o4N7M0l0Pno2J45l5j01P9k0n0P6q7P7N6l5J9k8j1j2l0qRr1J87l2m8pL7Q
7841A40m4j9K1K2n2j2O4j4K9Q5m9r9M3L9j04O8J03m2r8L9p8K6N4o3K2J8j8L4Nj2k2M2m1KK5
7876A14J5o3O4q9J7P2o4J9Q5j09rQ1l7J2lj2Nl8M4K2L6k0l1RJ1no7N3j4O3o5j3j0j2P4Q0j53
7913F2N2n3J42l7n0J6kl3k1M0m5L3K4l6J9j9ON9J2q8k4l7k0R7k0K8k5P1m1L2o2M3j5M9j16
7948D1N1K8k8N6J5j11N2m3nM0n0L3J4O3j5m1j0M9n0M7Nk8j23J41l1K0p9Q0L6m4l6J8n2J01
7982A44Nj19P7M0j4r0Q6J4n3L1J2k5j3N5r8O6L7p9l2K9Kk0jP9l2J5j03J53p5L8o4M0N6o3J1
8017A09k7mP0o5N1p8L4O3p3K1k4M6l3N2j04J20q8m2N6j9L9j3M7n3L1j4m8J29p5k4N7k8kK5
$$ y = [180, 132, 90, 186, 100, 117, 149, 155, 137, 83, 93, 125, 81, 90, 143, 31, 147, 34, 164, 134, 146, 94, 31, 148, 169, 130, 108, 113, 97, 138, 88, 98, 94, -3, 162, 134, 177, 133, 99, 35, 92, 132, 102, 109, 104, 42, 187, 152, 51, 130, 110, 60, 136, 49, 126, 182, 147, 166, 138, 127, 115, 85, 77, 86, -5, 182, 150, 102, 95, 132, 140, 96, 77, 98, 120, 68, 56, 120, 106, 135, 220, 171, 72, 115, 154, 50, 118, 221, 179, 81, 120, 42, 68, 122, 59, 81, 99, 81, 115, 120, 108, 86, 128, 87, 89, 114, 129, 66, 130, 41, 58, 130, 66, 85, 170, 61, 52, 133, 96, 108, 105, 93, 98, 60, 104, 126, 162, 142, 111, 120, 131, 126, 59, 112, 98, 161, 96, 83, 73, 61, 135, 215, 62, 114, 61, 203, 166, 116, 132, 130, 97, 76, 116, 71, 104, 128, 92, 111, 92, 98, 157, 169, 81, 57, 20, 0, 97, 77, 105, 80, 151, 110, 142, 80, 123, 108, 157, 41, 92, 120, 92, 148, 163, 52, 104, 61, 56, 96, 46, 79, 93, 156, 141, 100, 90, 139, 89, 136, 141, 113, -10, 131, 100, 120, 41, 121, 157, 113, 77, 95, 43, 144, 149, 30, 107, 147, 133, 43, 129, 143, 90, 121, 133, 108, 95, 150, 52, 118, 155, 76, 44, 73, 75, 55, 54, 133, 101, 116, 13, 166, 91, 129, 65, 105, 161, 98, 109, 82, 78, 148, 83, 134, 56, 90, 153, 80, 101, 77, 123, 90, 142, 38, 158, 70, 28, 84, 65, 104, 91, 138, 85, 116, 102, 54, 183, 108, 84, 141, 113, 111, 136]
8051A36j0p6N2%Rk1j3M6j2j8o3Q5M8j30M3N6j5m1J02k4k3j0n7RqM6r0N1K8J3N4q6N2k1j7N3
8087A48k9k8k6RK1o9J13L9j9M0r5j3LJ7J0j5m1O7l9M6J7j9L0j06L7O1m3k1pJ9Pj1j4J10p2
8122A27Pj0%j3NL0Ko4P7%q2M4k4J1Q7j23K1P2j28J29l2m1pq0J50j02lO9jk6Lj7L4p0Q7J5m2
8159A05p6J16l4P3q8J1M5l9k2j9L9k1R1l4o2L4k1N7m7j8j4M8m9kP4p0l2J5LJ18k1Pj03KJM6
8195A13J5k6K6q6M2J6K3m0l7J25j08R9J2q9N9o5QR0m3%p4R2k7o0J04r1L6m3Q1o1Lj7R9l1m9
8230I6N7rm9M7M0o2k0Pmm8R1k9k7J7P7p1j0o7M9m4Q4l5K0J6mK2K7j03L5N9l1rOl1M9r5J04
8267A55L1p7M0J4o4qL3L6j4n5M4j0m6K5O0n3M5k2o4R5m4J15p9k5m4k1J04m9p2L8m3m0O8P6
8301A49j8p1J9J6j0nK2j3O8J2O5j12k7k4N2r2O5m4N6J0mk9k3P5N4l3n4j5K9j00J26p3J0k1
$$ y = [136, 126, 50, 102, 102, 111, 90, 77, 123, 111, 93, 30, 115, 163, 33, 76, 132, 117, 76, 178, 154, 131, 121, 64, 73, 65, 111, 21, 72, 100, 113, 167, 81, 133, 112, 95, 148, 119, 91, 65, 74, 95, 26, 139, 178, 159, 199, 104, 91, 94, 111, 121, 106, 65, 132, 93, 139, 156, 137, 167, 61, 98, 159, 116, 95, 88, 107, 114, 103, 89, 199, 127, 134, 124, 124, 111, 116, 146, 148, 84, 161, 161, 79, 123, 99, 110, 197, 74, 95, 167, 39, 168, 136, 95, 88, 8, 158, 56, 53, 122, 121, 95, 98, 81, 115, 45, 132, 147, 105, 29, 145, 111, 184, 96, 107, 152, 113, 91, 72, 111, 90, 181, 147, 85, 119, 98, 155, 108, 90, 76, 124, 75, 73, 147, 77, 45, 60, 63, 181, 160, 167, 64, 66, 67, 113, 128, 102, 128, 42, 84, 100, 123, 83, 46, 171, 63, 162, 174, 85, 144, 79, 87, 177, 134, 134, 60, 152, 125, 65, 169, 78, 114, 71, 152, 91, 94, 77, 176, 145, 96, 153, 144, 95, 142, 182, 120, 100, 107, 103, 55, 146, 117, 90, 107, 184, 113, 103, 36, 85, 41, 125, 90, 110, 126, 122, 144, 171, 68, 103, 162, 131, 122, 128, 97, 146, 51, 155, 186, 109, 149, 163, 99, 91, 124, 160, 146, 91, 135, 125, 79, 104, 164, 111, 156, 134, 70, 165, 121, 236, 157, 132, 88, 67, 171, 122, 50, 88, 45, 5, 73, 149, 131, 60, 79, 95, 85, 80, 102, 89, 157, 169, 234, 122, 95, 71, 123, 31, 96, 52, 108, 118, 114, 85, 62, 137, 191, 158, 104, 89, 118, 18, 144, 71, 81, 60]
8335F0L1m2J9M1K9q7O3J6k2lkJ5kJ1m4r8J88p1L1J8l3j0L5J2j3o1K4jP7n3k7k7J3kJJ7JJ4
8373A18n3R2r1P4q3P5kMm7n0N0K2m4Q0k1p0L4L0J8j02R7Mm2L2o3Q2l7L1j1j9j9L4no4R7n3
8409I8K8l8j7Q2K9j0l2j4l2o6O2K1M7r2K0Q1o1O3j02L9k3N1L4j8o0nm1l0J31k4k8R2r8J9J2
8444A18P0lj21N6N7l4m9M1n1j5P5k5L3j0j5M3mp8LOMR4n1j6o3O2j4%q7R1oJ8m7O8l2J4j3n
8482A14J9k8L9o3L5l8k3qL9L2L4J7q7N6j3l5l5J04j6k3l7R0j8j17M5J6n9M4nj5M0L4l8K4M6
8517A70l5K8o7J2jL0K9n5m1rN5n1Q1o5PO6o4L4Qr5Q3o9P6Oj5J6o0M1J2k9L4j7M4p3K5N3p9
8554H5k5K7R4j17mL7K1mK6l4l8N7K0M3j21P1o5K5nRJ9k9M5o9M7L9Ll7k3KPN2m5K4p9kQ5K1
8592A62k9m7M6pp8Q3k0K9r1Q3N6n7POn6%O5r7O7L5j0m6J0kj9N7o6L6m7J3qoK2O4l1K2r6J09
$$ y = [60, 91, 49, 68, 109, 138, 51, 114, 130, 108, 105, 103, 118, 116, 127, 83, -15, 173, 102, 133, 151, 118, 108, 143, 155, 142, 81, 105, 104, 181, 128, 101, 74, 87, 85, 86, 103, 104, 118, 65, 157, 66, 140, 57, 132, 130, 134, 87, 37, 87, 109, 65, 145, 124, 54, 88, 118, 136, 34, 131, 135, 93, 125, 62, 144, 107, 138, 127, 108, 89, 123, 118, 54, 151, 98, 126, 88, 71, 153, 182, 172, 140, 126, 94, 28, 90, 111, 158, 66, 86, 167, 106, 169, 67, 106, 83, 134, 168, 150, 90, 85, 44, 14, 145, 121, 93, 185, 87, 106, 118, 188, 185, 64, 120, 177, 143, 94, 135, 84, 69, 144, 119, 152, 142, 127, 170, 166, 88, 91, 97, 101, 195, 144, 128, 65, 127, 113, 113, 26, 117, 111, 129, 82, 150, 118, 132, 119, 114, 133, 105, 144, 81, 116, 78, 55, 47, 86, 118, 152, 169, 82, 138, 125, 90, 55, 159, 143, 120, 83, 173, 155, 38, 83, 99, 40, 84, 79, 64, 104, 138, 100, 124, 170, 135, 163, 96, 108, 107, 137, 166, 111, 70, 61, 116, 65, 146, 81, 88, 154, 90, 124, 132, 37, 120, 51, 127, 133, 118, 134, 74, 115, 127, 98, 132, 115, 159, 86, 111, 164, 85, 60, 87, 181, 64, 60, 97, 118, 114, 140, 106, 68, 125, 145, 188, 67, 138, 73, 98, 93, 102, 121, 92, 137, 68, 115, 154, 157, 120, 97, 99, 106, 158, 113, 137, 58, 56, 141, 162, 133, 86, 132, 125, 47, 130, 110, 139, 48, 131, 187, 130, 137, 143, 87, 87, 152, 55, 122, 157, 147, 101, 111, 109, 90, 147, 81, 117, 70, 83, 75, 69, 91, 155, 124, 146, 50, 159]
8630A59m6k1jL1J4r9N3M6q4m0Q6%M6Nm8j04J12j0KL6l3k3K3m3J05l6l6j8Q0m3k8J02l4m8K7
8665A32r7J08k7n5k7J46q7KL3Nkn2k6J05o0m6N3N4jl1n0K8O5q1%R6Nr4K8n1J3J1K1rM6qk6
8702A21jo7N0N4j8k0n3L4o8O0j3O7%oom2nM0K7l1J5k5P4r9j4R0j6o8O6j05J88j02J1o6P7q3
8738F6Q8k5l1nk6QpK8M0m1N3m1O1m3j7L2n9nJ16q0J5r5J48m5l1JK0n1L1K7L6q7Q8jo1k8k2
8775E7M4n8Q5l7M1o2%j8P6L6qj8K7n9J2J7j6j8n4R4L0n5L4j3n3N3PK7J9r2J6j9O3j5K8j75
8811dJ13k2M3P0j42J2M1%L7p0P9q1N1qL7l9K1k1pL8j46N4N8pp6Q4Ql4J9K3j3k2k7O1%%j7l6
8849G7K7l3J9M6l4nl5J08m1l5LjJ6K8K1j1k0L0j1J3q3J6k1J1j4K8K7J4l8okM5j5l0J0J1j5
8886A00LmRm8K4M6qm6M8o2nQ9k2m6Qp3L2M6P3m5K4k5J3m1M7m8M0Ln9L5M6mk6l4j2Q5q1Jl6
$$ y = [159, 113, 92, 91, 122, 136, 37, 90, 136, 52, 12, 98, 98, 144, 149, 101, -3, 109, 99, 101, 137, 104, 81, 104, 61, 166, 130, 94, 76, 156, 113, 85, 187, 153, 105, 132, 35, 143, 116, 61, 34, 180, 93, 95, 128, 133, 131, 79, 53, 158, 98, 52, 105, 159, 158, 127, 77, 105, 170, 89, 89, 185, 190, 96, 124, 73, 86, 97, 118, 109, 155, 147, 121, 120, 53, 103, 157, 139, 119, 66, 100, 32, 92, 79, 146, 146, 140, 134, 92, 87, 127, 154, 123, 138, 113, 187, 88, 74, 164, 148, 80, 146, 41, 229, 127, 138, 72, 149, 66, 154, 129, 98, 93, 67, 75, 68, 96, 136, 95, 148, 107, 168, 125, 108, 140, 81, 76, 192, 112, 127, 32, 180, 135, 104, 105, 125, 74, 105, 132, 168, 81, 169, 168, 107, 79, 57, 101, 43, 128, 91, 132, 70, 70, 52, 128, 164, 156, 138, 165, 106, 118, 135, 119, 101, 47, 141, 171, 116, 150, 137, 84, 137, 144, 171, 190, 98, 114, 95, 158, 143, 171, -4, 109, 87, 130, 200, 58, 70, 111, 111, 148, 78, 157, 76, 127, 119, 156, 117, 138, 117, 110, 148, 2, 56, 114, 107, 31, 115, 123, 89, 108, 131, 118, 96, 69, 130, 130, 130, 113, 77, 104, 71, 90, 136, 102, 97, 62, 170, 129, 94, 97, 96, 112, 140, 161, 150, 130, 160, 149, 162, 79, 95, 74, 85, 71, 99, 126, 140, 102, 96, 94, 139, 124, 94, 104, 115, 100, 103, 99, 108, 60, 84, 130, 122, 76, 124, 62, 57, 146, 124, 78, 86, 13, 45, 91, 164, 119, 143, 118, 131, 90, 137, 89, 129, 132, 73, 108, 154, 150, 124, 90, 78, 163, 82, 83, 47]
8925D7O8J8K4l8l5K4K2Rl8m7N5Kj4Lj6k4J34j70J52p7N8m1n0Q0p6J0k5L6O2q0mL2K7J2L2j1
8961A61k7o1Q4l3j1M0o0Lj0K0N2j09J42q2ro0J5M3Q5n4k5L0n8M8m0O1o0K5l0J37j25M5o3P
8995H1O3n3Km0K3K5K7J0J4m3Ppj7M3Mmn1M6l1L4l8o7K5qN9qj6k8J52q2q2J01j7k9mj5N0n4
9033G2N2l7J9m2RK9j8L7qr5Q8kl4J46j34nO4m1k4Q8n8NQ3J9j82J13p9K6N7o3oOM9l5N4m7K2
9070A28lo6P5o8J16j28j0P8j04J08l7J1j4n0O0O3q0K4o5J07m4Ln0L5mN0n6n7J43pm8M2m1n1
9104F0N7lj9L0k5oO7r6p0J52p1MN7j36Q8L6j9P9n3j3l9N5n1ON3n8J16n5m7K1K4o0l6O9k5Q7
9140A79jk0q6j1M4pn3J53j21L1L3q2P6j26J08J6k4Rk8jO3q3mMJ04p2K4n1M2l2j9P7m0N9n2
9175A09Pl1N1j4j9J9l4M0J3m9PL0kql1QRj4O6r1J3Q3l1okl2j7N4l3pP3r5Q3k7K3o4L8K4m5
$$ y = [47, 115, 133, 157, 119, 84, 108, 130, 139, 101, 54, 109, 111, 97, 100, 84, 60, 194, 24, 176, 99, 157, 116, 66, 146, 70, 80, 55, 91, 153, 73, 69, 101, 128, 140, 172, 161, 134, 73, 157, 124, 113, 153, 93, 96, 86, 106, 158, 49, 191, 109, 100, 40, 55, 98, 183, 129, 104, 134, 76, 124, 84, 145, 85, 110, 80, 217, 92, 137, 74, 81, 144, 91, 93, 53, 76, 101, 128, 138, 152, 109, 116, 109, 92, 135, 139, 135, 84, 130, 99, 133, 95, 28, 53, 45, 104, 96, 80, 52, 204, 122, 40, 141, 124, 95, 91, 76, 126, 72, 124, 87, 106, 64, 73, 102, 84, 121, 113, 18, 106, 104, 70, 216, 82, 77, 141, 100, 76, 164, 106, 111, 194, 213, 31, 144, 65, 91, 148, 85, 79, 85, 134, 99, 153, 106, 128, 125, 59, 134, 66, 182, 54, 44, 122, 18, 126, 89, 100, 86, 36, 96, 159, 79, 103, 38, 145, 101, 104, 54, 89, 85, 135, 79, 22, 165, 158, 110, 152, 111, 60, 117, 114, 95, 125, 100, 94, 161, 65, -5, 147, 76, 80, 137, 1, 89, 125, 106, 185, 132, 119, 80, 135, 84, 90, 143, 85, 201, 146, 99, 120, 144, 84, 48, 117, 92, 179, 178, 158, 72, 61, 105, 98, 45, 198, 77, 108, 141, 59, 135, 9, 117, 133, 109, 118, 90, 89, 152, 69, 65, 69, 173, 101, 125, 74, 116, 84, 65, 142, 102, 161, 109, 116, 85, 136, 122, 103, 122, 88, 128, 141, 92, 99, 129, 127, 119, 88, 96, 105, 91, 157, 66, 79, 162, 131, 125, 123, 91, 74, 128, 95, 88, 161, 66, 149, 122, 145, 81, 119, 143, 98]
9214I8M7j15N3k7J28p0j4P0q4l0M0J5j42K35q4%l5J8jJ3M1o2k9K5r0J13J9l7j8K5O8l7o2J0
9248H1M9p0k5J27j40J08j16P9j9J1P7q9Q1r0L7P0j46L1O9o3J16m6j7L0j5K4j04K2Q8l3Mnj
9281A25m8Q8j05J16r4jR2j03R2q8J0J03j37L6nK3Q1j55Q8j03O2J3L8K2m2o6nL9O4l1M1Nn0
9314A05Nk1k5L9k6K8rk6kl2RO4K8n0%l9J18p7L8L1p3L0N5r4l4J38r2j4L6N5q6M8l1RN4q8K2
9351I3K4K4m9O4p6P2l4M8j03O2l9OK9J6m5K2n1P2n3K9J7k3JM4M3o1Kl3P3q3kK3MqL5p7jk0
9389D5N1J2n7K7J2N8Ro6LL1r1N8qQ6n3K0l5O9n4nJ1K6r5Q6q6O6rn7N9kJ3QKq4j2J12n6j9k7
9428D8nL4Q0r4O1J2Mn1N7n0MKj8J6M2n1L0J0Ln0J9JL8L9r9N5m0K7k0j0J2J3nl2M6j0j4k2P0
9467A52N2q7p6M0J5J6M1j2r1K9J63j70J1PP7n3p4Q9k6M7j2Lk3pK8L0l5p7K8j9N4rK2j07O1
$$ y = [98, 145, 30, 83, 56, 184, 114, 100, 170, 86, 56, 96, 111, -31, 204, 120, 120, 85, 103, 102, 115, 156, 94, 65, 90, 0, 113, 132, 95, 77, 102, 170, 133, 71, 81, 130, 60, 35, 162, 22, 130, 14, 93, 74, 85, 162, 73, 154, 64, 101, 171, 25, 56, 125, 62, 178, 132, 115, 145, 130, 154, 50, 72, 160, 127, 131, 126, 125, 77, 165, 60, 176, 82, 81, 173, 70, 162, 74, 84, 187, 50, 86, 81, 104, 185, 30, 118, 15, 77, 90, 128, 150, 108, 42, 37, 76, 140, 109, 150, 155, 105, 110, 89, 64, 103, 77, 105, 96, 70, 68, 36, 45, 109, 137, 87, 87, 48, 166, 89, 127, 158, 85, 115, 170, 76, 42, 180, 88, 74, 110, 165, 79, 127, 96, 105, 159, 71, 93, 117, 141, 92, 156, 80, 152, 118, 166, 63, 125, 86, 92, 121, 137, 92, 114, 63, 135, 82, 111, 128, 105, 106, 150, 193, 132, 134, 101, 174, 91, 89, 112, 116, 108, 143, 66, 65, 45, 96, 108, 51, 78, 90, 148, 157, 91, 94, 125, 34, 92, 84, 170, 117, 137, 102, 171, 117, 112, 123, 149, 54, 140, 54, 120, 111, 54, 113, 111, 124, 132, 134, 50, 38, 150, 94, 75, 48, 43, 77, 157, 63, 124, 136, 140, 89, 146, 96, 100, 102, 84, 100, 142, 91, 121, 131, 134, 84, 103, 104, 142, 181, 82, 137, 97, 124, 104, 94, 106, 119, 114, 82, 128, 118, 104, 82, 152, 204, 117, 41, 81, 96, 112, 153, 141, 50, 79, 242, 72, 83, 90, 167, 114, 40, 129, 103, 150, 138, 141, 118, 111, 139, 169, 134, 57, 85, 66, 120, 111, 133, 26, 87]
9502H7K2j5K1l5K7J4J4K3o4nn4P2N0l6pr5P0n5J1L0N2l4J0N1r6Q6j9j0rk0L0o1J02k8Qm6J1
9539A02L8n8P8j36J01p8M7o0R4O9j08K1j1L1J2j2j6p7P0N1l8l5o3R4n0L7O4k2n9J2J1q4J48
9572A73r4M0l9L2Lr1J07q7O0K9j05l3R6N4N7n8j13J14K2m5m4NP8l2m1O6q4Ok4M8M8ro0K3L9
9607A41q4N6KM0jj14J11l3l5J6J0o5O0K7l6M9K0o1j3N7m0Lk6O5n4n9N6k3J7P9p5M5J6j40J12
9642A23L4l9l6k2lN5j0P7n3m7J6j3O6l4l1o0N5K8P2m8j6mP6k19J36NJ2l0J3PQ8l5j3o2Mo4
9678B8J06m0k1R8n8l1k0O1m1j1P8n0L6j5l2M1l8J2l1N4J3m3nn0M0K0J2mj3J9Ol3NN5ol5M2
9715A49k2l5R5p6q7P1k6OJ8nJ3OmP3k2o9M6L5l0ko7P2rp8P0j6M7p0O5k2Nk4n9P6O7r6j1M2
9753A26k6O3Lm5j8j8J9M0Rl3P1r8l1L5K6J5k9m3P1q1J31j19kP8M2j8l8o9J33j27N9nlk8n9
$$ y = [87, 109, 94, 115, 80, 107, 121, 135, 158, 94, 89, 35, 107, 157, 121, 114, 19, 89, 34, 45, 75, 127, 93, 103, 154, 58, 144, 125, 115, 106, 86, 116, 55, 157, 129, 137, 91, 102, 140, 82, 160, 24, 125, 47, 94, 34, 128, 197, 89, 110, 99, 130, 142, 130, 114, 37, 107, 158, 120, 85, 22, 116, 66, 103, 167, 145, 86, 98, 109, 25, 173, 79, 119, 80, 112, 115, 24, 131, 44, 104, 133, 28, -5, 91, 145, 202, 144, 31, 145, 167, 122, 78, 83, 161, 129, 88, 154, 70, 76, 52, 100, 148, 139, 79, 102, 141, 57, 113, 115, 155, 154, 40, 151, 118, 83, 99, 109, 44, 104, 131, 95, 144, 164, 103, 90, 147, 107, 110, 84, 149, 95, 36, 92, 69, 86, 165, 90, 135, 151, 11, 123, 157, 118, 82, 60, 57, 112, 102, 179, 126, 79, 95, 82, 148, 114, 83, 23, 78, 106, 178, 130, 114, 110, 186, -33, 103, 108, 120, 90, 103, 110, 198, 163, 150, 88, 92, 28, 134, 94, 73, 171, 113, 82, 62, 123, 82, 71, 149, 99, 135, 120, 88, 129, 91, 103, 72, 126, 139, 96, 91, 41, 81, 101, 113, 109, 96, 115, 121, 88, 93, 148, 142, 107, 149, 127, 92, 187, 111, 24, 95, 69, 75, 93, 88, 101, 107, 103, 176, 154, 85, 131, 166, 136, 134, 67, 139, 130, 52, 122, 106, 153, 83, 148, 126, 131, 107, 48, 124, 191, 95, 84, 126, 100, 163, 166, 121, 103, 85, 104, 144, 153, 120, 191, 93, 62, 97, 123, 138, 109, 66, 137, 56, 187, 68, 66, 144, 186, 168, 130, 61, 194, 67, 126, 121, 118, 90, 31]
9788C1L9n1P6o3M7O2j51J82k0p5QK8k0K8n8J08o6ok8O2m1kJ14k4l8j09Q8M8n6j06P3P2K7j53
9822B6J8Q0p3J05o5NJ5k5M9j11J4L9Pl5P2q1P6o1L0pN2j2J9J8o5M4k5m2J00m7m9j9M6PM2p2
9858G5mQ2n5Jr9J55K2r6M5k9mL7o9L6J7mj5kKrj7O9j7Mn0k5QL6M0q0O2q5N4M7Mo2K3J5ql2
9898G2R3l0o8M0j4M1J2q6L4M9%o0P7k0l3k0L4l5K9l1j2JoK9M3o0L2J02j04%rj1M9n7M2k3M6
9935A46nn6M3m0O4r7L7OLk7M8lL1oo1PJ9L0M5l5o3L0O5r9Q7p6O5n1Q2j5q8M2n3M2m5l8P3L0
9973A37k2m9L8J1%L3ql8LoM8k9J0j0K5o8m4L3M9m7O3oK6l8op1L2O2qp0MK6K7M5m4O2k8k3k3
10012I6J3J2k2j7J2o4P9o4Q6J1p2M5Ll4K5J1K6L7j33O6J4n7J54j36n3O8Jl3R7j38Q4n7J33
10045A93j24K8N2o1K5j9Pj8O0m9J4l0L2lQ6j37P%m0R5k5rN5J4%k8Jj09O3N4j6l1K8j07J63
$$ y = [31, 70, 19, 95, 32, 79, 141, -10, 172, 152, 77, 85, 113, 93, 121, 63, 171, 105, 99, 71, 133, 92, 90, 204, 180, 142, 33, 121, 169, 113, 7, 80, 152, 179, 26, 44, 124, 51, 156, 91, 96, 111, 86, 135, 24, 38, 77, 84, 49, 121, 40, 116, 55, 85, 78, 130, 118, 137, 155, 90, 134, 109, 67, 167, 120, 71, 52, 98, 105, 147, 75, 71, 153, 98, 99, 0, 155, 177, 81, 126, 97, 93, 130, 61, 97, 114, 110, 95, 93, 95, 86, 69, 138, 121, 125, 75, 50, 58, 94, 134, 54, 116, 31, 85, 132, 136, 74, 97, 112, 104, 72, 165, 135, 67, 107, 93, 134, 146, 60, 94, 143, 143, 83, 160, 140, 107, 87, 121, 86, 115, 84, 72, 73, 67, 96, 139, 79, 111, 213, 109, 109, 100, 89, 138, 81, 123, 100, 146, 141, 85, 128, 88, 152, 55, 92, 98, 101, 74, 122, 119, 150, 144, 83, 90, 109, 139, 184, 149, 86, 116, 181, 82, 169, 93, 158, 107, 189, 174, 86, 128, 75, 117, 72, 34, 107, 137, 115, 66, 104, 115, 115, 148, 140, 102, 105, 99, 147, 118, 128, 118, 143, 75, 31, 64, 113, 66, 129, 123, 149, 111, 105, 34, 66, 128, 120, 50, 54, 80, 107, 152, 108, 170, 142, 119, 96, 109, 121, 99, 82, 94, 30, 109, 45, 131, 142, 70, 115, 118, 84, 109, 120, 146, 183, 50, 116, 130, 73, 227, 91, 38, 106, 107, 74, 171, 33, 117, 60, 193, 69, 97, 149, 88, 113, 94, 101, 83, 143, 94, 108, 78, 110, 107, 193, 56, 63, 63, 23, 118, 93, 84, 139, 153, 153, 125, 126, 17, 80, 134, 118, 87, 115, 8, 171]
10080A71q7k4K3L7j8Ok2QOJ0Jl0L6j3L7n5N6m0j3J1l7K2L1J00j06j8KL1L1j25O1j4Nq4Q6j1
10116G4mQ0n5R7n8n1K4MK0Nl4M4N8j8o8rk1kO4n2J1m2j2J34j06j5K7O0r4J0J2M1n3K7M1j36
10152CJ33j2p7R4n8l6J57j72M9k6L3M6J8n6O3o1M3o4M1l3OKrkj1N2k3mK5q0RO7K5K0n8RLm5
10190G1L0j9j0NNJ9L9j56J06N0p3M3j03R9j0QQk1NO8j08K7Q9q4l8O0m6P9q1RM1n0j3N7J9m9
10226G6J5%Oj8k2K6m9M6P1m7QN3m9JM8p8L1j9Mrnl3Mj3J61j34N3m1l7MN4k6N2K1r5J28jq4
10264A02m2N8o6%J00r6O1k9j7K7L8qJ0m9j1N5k3kL5o6O4j5L1r6K4N4j0Qk6j1L0k6K3j00J14
10299A41Km7P6m8n3K1j6l0O7N1q5N7j8ML0j01M0j1L5j8L2j1n8M0j7L1q0N5L5l5l7L4l3L5%
10334H8Q1j00P3pM2n9n5R7p8K9jn5L9n5L6L0k2nK8p0J36j30K4M4%K9j16Q1p8J06K4o2Kn4j3
$$ y = [171, 84, 60, 83, 120, 102, 108, 86, 94, 100, 110, 111, 81, 117, 104, 141, 86, 142, 102, 89, 100, 63, 85, 116, 216, 110, 92, 94, 125, 156, 31, 92, 78, 83, -1, 85, 74, 70, 150, 95, 192, 134, 83, 107, 111, 131, 136, 102, 146, 204, 186, 118, 109, 88, 86, 150, 98, 109, 67, 55, 189, 83, 68, 95, 155, 61, 71, 83, 124, 71, 98, 139, 3, 136, 124, 47, 141, 83, 47, 204, 32, 81, 55, 88, 134, 152, 96, 159, 98, 141, 77, 118, 85, 91, 93, 84, 82, 71, 123, 100, 96, 121, 41, 50, 117, 142, 162, 104, 113, 116, 71, 101, 82, 72, 77, 82, 101, 140, -16, 90, 140, 67, 110, 7, 106, 96, 104, 112, 91, 96, 164, 56, 83, 172, 88, 50, 110, 64, 143, 62, 71, 112, 62, 49, 106, 125, 76, 91, 91, 97, 79, 57, 83, 34, 80, 151, 104, 112, 165, 116, 117, 165, 87, 118, 99, 103, 94, 89, 56, 60, 47, 208, 74, 127, 86, 49, 53, 107, 81, 133, 154, 59, 187, 186, 102, 60, 118, 52, 52, 152, 56, 117, 88, 71, 98, 136, 128, 138, 89, 78, 133, 110, 108, 143, 77, 141, 126, 157, 61, 85, 139, 129, 137, 111, 100, 130, 104, 127, 27, 141, 143, 96, 172, 124, 71, 92, 76, 46, 113, 164, 79, 136, 118, 122, 152, 51, 91, 80, 115, 97, 129, 118, 60, 100, 83, 114, 34, 89, 124, 89, 52, 86, 53, 88, 88, 169, 69, 142, 135, 177, 118, 63, 160, 82, 111, 110, 55, 94, 39, 75, 105, 83, 78, 106, 36, 172, 42, 66, 110, 110, 139, 23, 104, 26, 132, 156, 94, 96, 42, 29]
10369B9N2m1J43n8J2l2L2Qk1Joj7j6K6k0k1%L4K1J5mQl8j4L1q4J24l9K9o4N3j33J35K5n9%
10405A11k3J2j2n4Q1qO7p6lm1N7p2L7L1N4l3l1N3p2O1j1k2q5L9P1l3qj7J07n5J9r6R5q4M1
10440A00n4L4k2QJ25j25P8o3j6OL7k7K5N5n3p5P1j1k1K0O4j5J5l7No8N3o1O4k5j8J02m6l3
10474I2m5L1M4pP6o8k5K7m9O0q6M5O7j4m7M3L2k9n2l7P4J7q0O8n2NQj0j3J4j3K7pL6l9N6o3
10511H6J1pN1J1l9k4k1J21p4M1o2j0O8j19R8j8p1O9nl1N8l1J6j6j1K2l9N4q6Q5lqk9J1P5k8
10547A45j9N9r5L1o3K1L1Oj6j1P3q0L2n9K7K9J7n7j3K6j3J3J6Pl1N5j9l8K2k3k3K5m1M2L0
10582A06m1L1m5J24n4K7lJ8m0l3OJ0O9p3L9k5k3rj2P0j16J29r2K0Q3p2k1K6nJ0k0O7q8O6J6
10617A45p8O4pk2Or2K6J1O4MM2l0k1jk4M3K1mj09L5MJ8J6J8l0J7N0q5P5j03O7n2J8kN2j0J8
$$ y = [29, 81, 40, 183, 125, 137, 105, 137, 145, 124, 125, 119, 102, 86, 112, 92, 71, 71, 105, 126, 141, 137, 145, 107, 93, 124, 40, 164, 125, 154, 90, 143, 10, 145, 170, 111, 111, 88, 100, 88, 34, 115, 107, 174, 98, 95, 54, 111, 39, 76, 107, 161, 128, 97, 150, 78, 139, 128, 106, 21, 60, 131, 98, 90, 73, 180, 125, 144, 48, 143, 59, 100, 46, 80, 58, 66, 191, 66, 144, 81, 65, 71, 108, 81, 106, 161, 108, 33, 104, 93, 72, 92, 156, 141, 156, 119, 124, 56, 109, 48, 112, 87, 69, 171, 125, 92, 47, 78, 122, 115, 191, 123, 98, 125, 76, 136, 50, 95, 162, 148, 101, 144, 176, 147, 95, 58, 132, 149, 69, 137, 85, 90, 98, 88, 75, 89, 76, 103, 96, 132, 93, 149, 86, 97, 90, 141, 152, 113, 89, 68, 189, 115, 156, 94, 84, 152, 33, 131, 113, 42, 111, 106, 75, 133, 102, 118, 102, 91, 113, 74, 128, 42, 127, 124, 116, 87, 98, 173, 145, 126, 185, 90, 121, 58, 79, 110, 116, 100, 89, 162, 82, 114, 55, 82, 111, 128, 71, 58, 84, 71, 84, 100, 107, 76, 131, 112, 74, 96, 73, 50, 75, 34, 76, 106, 65, 96, 51, 175, 121, 148, 145, 163, 123, 90, 96, 106, 175, 102, 141, 116, 93, 84, 72, 142, 26, 155, 63, 83, 166, 94, 73, 99, 94, 104, 84, 151, 63, 129, 145, 67, 131, 124, 102, 108, 16, 42, 53, 117, 121, 163, 133, 112, 111, 87, 130, 151, 147, 38, 73, 77, 95, 111, 129, 99, 116, 166, 81, 156, 53, 120, 68, 86, 84, 136, 126, 144]
10654A44n4n0J00k8J6ko0m8J04j24J15KJ7OK1o8k2K2O5q1R3j35J26q8K5J6J0k9ML7p8kJ13
10687A67j14P0m5j5J12q2N5m1p4K6J9K9r2J21jkk6J3J4M1n9j9pj2P0j9n5K8K0o2O1j0l5N6
10721A32M3j16J19o2o7JN4N8q1K8Q4n4m8J9M1m0p1k6Q1RJ7m6n5Q4K5L4m9Qn4P8l2qp0K9M7
10756A12P5j6q9M2N5j8o8j7Q0pn0OLk1P1k4r0M3Nk5J0O5o9K3O3n2J8k9M1q9L9L9pK1l0J9j3
10793A16Rn1M3Mk0o0O9j4J3K2P9p2m7M3%j67J68n2n6K7LL8P4m7n2O7m8K5l6L2j2J3N4k9p5
10828F1L2m3R2m6OP8r8PjJ8Lo7O0QP5k4p2NL3q4J10q9l5L8kP5k2O3o0m9J9J0j6PL2j2k4L5
10866A23q9N9L5J2O8r9pP2n0m6M7j1j3jj1KK2K3k8K2p9J00l6qn3K3k0Q5%m2j0j1J2m4Q9n8
10902G8J7J3L9l1k6J9j1Nj3J6M5j3k1m2N1m6O2p0j2Q6l5l5L6r9J33n0l4L0m5K9j4JJ33j06
$$ y = [144, 90, 40, 140, 112, 128, 126, 66, 18, 122, -2, 113, 115, 132, 138, 159, 91, 69, 91, 156, 75, 168, 33, 159, 71, 96, 112, 122, 93, 97, 134, 56, 54, 167, 53, 123, 78, 63, 175, 93, 148, 107, 33, 59, 78, 107, 15, 136, 135, 133, 107, 120, 134, 175, 116, 97, 90, 78, 148, 129, 74, 102, 122, 60, 121, 111, 76, 132, 175, 59, 178, 116, 49, 50, 104, 162, 81, 109, 193, 139, 91, 110, 151, 111, 40, 14, 95, 104, 121, 75, 20, 104, 129, 163, 114, 122, 68, 146, 114, 106, 36, 65, 112, 187, 171, 82, 124, 179, 161, 93, 76, 156, 149, 99, 105, 108, 87, 158, 134, 44, 87, 92, 67, 77, 142, 73, 96, 159, 107, 125, 96, 137, 48, 87, 126, 119, 140, 110, 129, 116, 125, 74, 117, 121, 101, 41, 110, 96, 109, 131, 210, 138, 91, 134, 134, -33, 135, 83, 27, 54, 57, 95, 169, 122, 70, 137, 89, 114, 78, 110, 98, 111, 165, 136, 61, 93, 50, 142, 96, 102, 180, 82, 89, 88, 106, 109, 42, 102, 110, 185, 161, 89, 94, 127, 43, 153, 64, 29, 67, 65, 140, 118, 181, 121, 72, 91, 101, 85, 92, 124, 112, 88, 123, 34, 93, 128, 140, 208, 109, 102, 174, 124, 78, 125, 114, 101, 100, 89, 91, 113, 136, 108, 130, 51, 151, 115, 107, 54, 77, 57, 142, 142, 100, 90, 79, 91, 47, 136, 78, 95, 108, 147, 116, 90, 109, 98, 103, 90, 106, 151, 138, 117, 75, 126, 80, 142, 72, 60, 146, 111, 76, 112, 13, 146, 96, 62, 92, 47, 76, 62, 63, 196, 90]
10936I0RL3j4l3k4Q0p8O0o3R1o1RMjkJ2k8K4L4k7n3J32j41O2M0o0J0K1j8Rn3K5J5KK9n4Lk
10974H2Pm4O2jN3j22J07r7O2l8KN9n4P5j00O6q0L5M0J2k0n1lP0q4J20M4j04k3k0K4k7P5k4
11008A03m5L1kk5M6K9j42R9N9o4O3r3Rk2N0k2K3k4j8Q8j9k1m6M7j9J5mqP1j0q2O6pK3l4Oj03
11045A8J59q7o2N1Ql1K2M3pL7op8K4MJ9J9j3j5L2k2%m9MM8l1O8q2JO1L3l3l1L7M6l0n2j2k5
11083F8Q9m2M2N2j23K7J3p7P0m5j3J00j02L5M8j6m4K4n5L3Mj3N1K1j0k8k9m8J34Pr8M9m1j5
11117F8O0O6j47J12o4j2M3l8m4j5P5j7K9o1L3J28mr5N8j18M4rN0l4k1KL2pq3L6P4p3pJ10j23
11152D8n4R2N1p0J0n6L6N9MoP3j51J12n9rK0K3%L8k2j3j6j7k4N8j05J33pl3k6rrJ2M8m3n6
11188C2M1L7j1n4K2J11j22N4M0l4M1m5l2M8j7jp3NO5o7M7l3R4l5m3M0m8MrN3j3PkN5j09J1
$$ y = [90, 99, 132, 118, 85, 61, 141, 63, 123, 60, 151, 90, 99, 103, 102, 100, 112, 84, 108, 142, 115, 62, 194, 53, 115, 155, 95, 105, 126, 108, 117, 64, 89, 104, 106, 135, 81, 84, 82, 89, 45, 107, 106, 159, 37, 144, 47, 109, 71, 73, 132, 78, 153, 53, 119, 39, 74, 114, 126, 106, 55, 52, 122, 38, 158, 202, 98, 75, 55, 79, 52, 127, 103, 58, 89, 87, 62, 108, 137, -5, 94, 153, 89, 152, 59, 68, 46, 96, 74, 97, 73, 55, 143, 124, 103, 57, 104, 85, 100, 96, 88, 159, 149, 67, 133, 126, 149, 115, 121, 18, 177, 90, 28, 79, 87, 56, 78, 121, 114, 151, 145, 67, 91, 95, 114, 133, 120, 105, 137, 115, 115, 66, 70, 118, 87, 155, 73, 74, 135, 168, 135, 104, 141, 187, 157, 105, 93, 68, 157, 115, 157, 209, 86, 113, 126, 49, 119, 74, 61, 161, 59, 94, 142, 126, 82, 106, 51, 84, 88, 75, 126, 147, 137, 109, 80, 32, 166, 173, 75, 124, 83, 68, 128, 194, 47, 159, 95, 83, 126, 88, 44, 29, 104, 87, 116, 55, 88, 216, 212, 117, 175, 57, 101, 92, 142, 108, 87, 89, 121, 114, 31, 67, 141, 68, 61, 171, 48, -6, 86, 137, 67, 77, 21, 57, 116, 120, 114, 187, 36, 148, 89, 80, 100, 123, 123, 161, 139, 126, 110, 93, 69, 127, 22, 155, 148, 115, 89, 80, 71, 83, 131, 88, 32, 73, 110, 99, 45, 67, 178, 56, 110, 150, 116, 157, 112, 80, 128, 111, 110, 37, 42, 107, 40, 87, 54, 148, 113, 70, 110, 62, 66, 57, 110, 97, 104, 102, 157, 48, 59]
11224E9J5R4p5L5j5m7P2j01M9j0k1N5lj1Jk6O0j00P4o0L6M8m9k5J9Q8j06N8p3J07m5ro9J35
11258A60m1k2m6P3kk7m3J6L3l7P3N9q3K8o1N5J9l8J2Ln3J8Om0J09o6J2l2P7n9oq7Q0l7J49
11293B02l8n1L5j03M4L6K3p7L6l9JO9m0Q7j10j3o6J06K2l3R7o0kNm6K3JK5j9K6oq1jJ01n0
11328A04j6Qmm7J04J7o0LQm3L3%l3Rk4jP9m2M1o7L6nQ2m1o7LM7j02O8J7KL6n5P6m3n2o7O9
11366G3O0k2m8L8mk8K5N7j7L1o0JL3j5Mm5M8j32J34J0q4L6j8J04m1K4m7o5J2R0nk1M9k3pP
11402A54r0M9j9L7m8k8J01l9m3K2k5J7lqk2P3n6k6Q6L0j52J07OJ6k8O9k1NM1o8l4j4K6pm2
11437F6M0mK8lj4j5L9nl3l5k2N6Oo2M5%Pm3R2m2K5j09J03M4q3j2K0N3j0q1N8k3L3O2o1n8N3
11474A15j2n1O9k3k2k7J12k5K1K4j04k0O9r4M5j6K6L8mj9j5L2o2O3l1M3j21J19r4M3J7R0r7
$$ y = [59, 74, 168, 93, 128, 113, 66, 138, 37, 86, 76, 55, 110, 107, 96, 97, 71, 131, 31, 105, 45, 81, 129, 80, 55, 74, 162, 56, 114, 41, 148, 103, 94, 25, 160, 119, 97, 51, 124, 122, 95, 52, 68, 101, 64, 137, 196, 113, 141, 80, 135, 154, 116, 128, 131, 78, 96, 102, 62, 171, 105, 117, 85, 162, 103, 97, 10, 90, 53, 202, 164, 113, 148, 45, 89, 125, 148, 71, 107, 68, 69, 138, 98, 185, 75, 62, -4, 102, 124, 91, 188, 128, 126, 131, 85, 108, 109, 134, 115, 141, 135, 54, 53, 154, 104, 88, 96, 92, 45, 149, 166, 106, 109, 117, 74, 107, 107, 74, 83, 59, 58, 137, 95, 136, 69, 105, 100, 182, 141, 74, 77, 124, 22, 90, 107, 109, 145, 90, 166, 123, 71, 4, 73, 133, 111, 63, 101, 97, 69, 94, 151, 134, 165, 105, 106, 139, 124, 128, 83, 131, -1, 133, 143, 59, 95, 77, 181, 140, 164, 117, 52, 64, 154, 149, 128, 177, 154, 147, 154, 64, 113, 94, 131, 83, 55, 156, 117, 74, 96, 71, 88, 85, 77, 55, 128, 72, 46, 132, 162, 10, 117, 123, 139, 111, 180, 159, 164, 205, 137, 103, 89, 115, 108, 66, 106, 102, 130, 127, 113, 98, 137, 132, 99, 64, 42, 98, 104, 42, 87, 87, 94, 51, 143, 101, 126, 17, 120, 164, 81, 69, 89, 142, 132, 51, 109, 86, 119, 181, 120, 62, 115, 103, 52, 121, 98, 76, 49, 161, 136, 157, 181, 77, 57, 126, 32, 77, 61, 87, 125, 121, 102, 87, 119, 57, 120, 89, 132, 11, 130, 36, 79, 96, 186, 89]
11507H9K1J4K4k7j0%L8K0o6l7J5j0oJ07m4m8m5J11j6j23J26k8j9O4K2L6m1r2j6Q5q3M2p7Q1
11541A07m7N4mM6j28P8l2k3K6JJ4J1k4k0P8m9qN0j4J1m6lJ3K0j9J07j02L1j9k5j7K3J6m8J7
11576G5mK1M3j05M4k3Q7j18J0Q0L7m0o5N1m9N1l4Q7o4K4o3O6k0L2%p5N4L7j0k5%k4jO6m2l1
11612G2J8M7Ql5k5J21j39k3L4O1l2K%l2M0j2M6p1nl4P6L9n8o9kQ1l9jK0K6l5M4l6KM0Qq3k0
11650C4O6K2K0j6rL9n4l3J01p4Nl0k5L1N8m9L5K5o4k2N2l7k7O1p0M1O1m2j0l2N3r0J00%p6
11685D4J08m4K5j8J4l7K5k8l2Q9n5M4o4K1j4K3oK4o4M3l8L4k9R0n6M4k6jK7q7L6KK2Rolj3
11722A03%l1k6J21nj09M0K0l3L8o7J02q7Q1q0j0K8K7jk9J9J5k9j2L6j6n9R9J4k6Lj7oL6k6
11757A13n2O8l4JQN4k8l0j3j3K6j0M4M0r1Qk7L2K4KRo2J5nK3J5j7j0o6R9n4O4n4J4N4j0LM0
$$ y = [89, 110, 124, 148, 121, 111, 111, 149, 169, 103, 66, 81, 71, 65, 172, 128, 80, 35, 146, 130, 7, 133, 105, 86, 150, 172, 208, 167, 75, 59, 144, 61, 103, 26, 107, 60, 114, 110, 156, 28, 106, 74, 51, 77, 78, 92, 103, 79, 59, 137, 88, 80, 130, 116, 127, 81, 78, 91, 111, 92, 199, 97, 128, 109, 84, 67, 90, 106, 58, 75, 71, 92, 135, 30, 74, 51, 138, 20, 30, 110, 147, 107, 42, 93, 44, 95, 61, 148, 84, 108, 45, 111, 91, 123, 123, 48, 102, 139, 129, 104, 104, 80, 79, 145, 103, 72, 90, 137, 145, 110, 85, 206, 67, 44, 78, 139, 107, 109, 109, 77, 117, 105, 151, 80, 75, 41, 117, 156, 98, 29, 27, 108, 69, 68, 88, 114, 79, 123, 87, 89, 129, 137, 54, 34, 100, 122, 142, 126, 117, 156, 102, 69, 170, 96, 101, 71, 46, 77, 135, 86, 121, 146, 82, 60, 112, 75, 48, 109, 39, 80, 141, 99, 89, 57, 110, 20, 120, 120, 44, 152, 108, 133, 115, 129, 92, 117, 89, 57, 146, 91, 135, 71, 92, 78, 101, 95, 119, 55, 98, 60, 94, 65, 155, 99, 143, 117, 116, 143, 56, 92, 94, 116, 125, 119, 116, 103, 103, 72, 46, 167, 162, 53, 93, 113, 80, 118, 51, 153, 66, 147, 67, 57, 85, 112, 111, 82, 101, 116, 87, 75, 111, 95, 36, 135, 149, 123, 126, 109, 103, 139, 113, 61, 129, 95, 96, 104, 158, 130, 100, 87, 74, 100, 90, 134, 174, 83, 91, 64, 96, 120, 122, 131, 69, 84, 79, 102, 117, 100, 90, 24, 123, 69, 133, 79, 93, 147, 137, 140, 180]
11795A80r8O0n7k1l3R8N0j25Q1Oj04L2k0L9J0k2N1p9Q8p3j5N3NO3m5j5M8k0o5%O5o3O9k7J
11830A17qn9Q1j1N6j12J04j42J01K1l4nl2j8Q5r7K7L1k7JJ5m4M4n6J01j7q4P2M6k6l5NN2m1
11864A11p4M0kL9o0J3k0R7k4K5N7o6j27J55o5Q4j85Q0j1Q3r1P6l2P7p5K4l2m7P7o0M4J5p6
11897E0O2l5%O5k0Om0m5M3Qk5k4R8j05K4L7j1j6M7m7M5qn7O6L0k0J0l3qJ6N4j69O8J00m3j9
11933A04k3L1L7p7l8R8j00J13Op0K4L3m6k7Q8p4L3l1L5j3rk6L2l7ON5m8L7j7k4n7O5N3k9J0
11968A14j2j2L7J0j2rp0P7J9j3o6J2O5j17P6Kl3O1m6O1J4l6o9O2j2N4q1Ol6R2k1l5L7l9O0
12003A40m8N0j5o8K3J15o5j0j20J45m4M1j6m3N7k3m1j6K2Ln1J13q5OK0J8l5L1p2J0O6L1q5
12036E4k3P5Pj07O9J5o3J03k6j7O8J5n4l3K0o3Q9m4M2k3jj8M9J0j2o3l3N6m1M3M3o0j0M7O
$$ y = [180, 82, 142, 85, 64, 31, 129, 179, 54, 135, 141, 37, 69, 49, 88, 98, 76, 127, 48, 136, 63, 48, 101, 106, 169, 124, 109, 157, 137, 72, 72, 137, 74, 143, 116, 117, 109, 50, 131, 120, 176, 64, 168, 26, 127, 148, 114, 109, 77, 59, 144, 47, 74, 105, 78, 79, 94, 50, 94, 38, 139, 122, 38, 110, 156, 130, 95, 100, 152, 111, 37, 77, 75, 114, 54, 67, 47, 144, 120, 145, 202, 136, 9, 164, 99, 183, -2, 78, 67, 150, 59, 135, 103, 180, 105, 129, 97, 50, 127, 67, 111, 126, 50, 112, 77, 77, 142, 122, 128, 88, 43, 86, 94, 69, 45, 143, 38, 62, 99, 88, 72, 119, 72, 117, 109, 52, 118, 148, 128, 138, 105, 97, 113, 167, -2, 66, 166, 123, 104, 81, 112, 149, 72, 34, 132, 32, 145, 151, 81, 105, 138, 92, 65, 153, 79, 112, 81, 116, 103, 94, 68, 100, 63, 69, 124, 76, 113, 96, 72, 15, 80, 133, 104, 114, 102, 90, 127, 137, 125, 116, 46, 123, 142, 129, 63, 75, 140, 23, 99, 101, 68, 129, 83, 144, 158, 122, 53, 115, 103, 157, 76, 82, 46, 138, 117, 82, 119, 80, 140, 92, 142, 127, 59, 82, 197, 132, 122, 2, 147, 103, 144, 128, 85, 142, 119, 78, 62, 84, 87, 36, 149, 64, 70, 90, 108, 73, 104, 32, 42, 108, 139, 54, 31, 106, 113, 6, 75, 90, 27, 130, 104, 87, 155, 170, 116, 83, 103, 40, 129, 85, 127, 104, 103, 85, 134, 144, 132, 69, 36, 92, 51, 94, 137, 77, 67, 114, 120]
12071A20q0Q8r1P3m9KN2m7L6J4N7j02Mj8N2L0K8n4p7O2j8N2n3q%j9J0L7MJ9m9mrP3rl3J5O9
12109A77j10P8N8j8r3%Q1j23R0J9n8k3O1p8R7r0R5p2j7NK7K4K4l3qJJn7j6K8O2j8l7O4Pm6
12145A02J5k1lK5r1O1K7n0k7Q0j1k7JN6o8l8P9K1k2km3M0n1O9J9j3j4j1%M2n7j6l1J3R3p3
12181G4mK5j3k0J24n1K6o0N6m4J2l7RO0Lq2J4N9r2L1nM8j9j9Rk5j5M3l3J10p6k1K5r9N8J8
12217H9m5L9m6m3J09j1kl2J3K6LJ4k3Jn4J25n7l2K7M0l9L6l3j7O2kJ4j15J5m4J08j07N6K4
$$ y = [120, 40, 128, 37, 110, 61, 63, 115, 68, 104, 118, 175, 73, 77, 59, 111, 141, 169, 115, 38, 100, 82, 134, 81, 73, 73, 54, 64, 101, 105, 124, 75, 71, 62, 135, 126, 93, 108, 177, 67, 145, 203, 185, 92, 92, 173, 50, 140, 159, 101, 78, 139, 61, 158, 68, 163, 91, 74, 79, 106, 130, 154, 121, 113, 114, 115, 58, 42, 70, 132, 114, 77, 141, 148, 102, 117, 96, 93, 118, 27, 88, 115, 65, 38, 118, 107, 80, 81, 137, 69, 31, 110, 131, 109, 107, 64, 104, 53, 122, 141, 128, 114, 103, 103, 145, 88, 72, 41, 54, 147, 74, 70, 95, 82, 62, 186, 135, 161, 101, 157, 113, 125, 88, 97, 157, 160, 78, 92, 151, 59, 90, 85, 133, 114, 95, 104, 79, 64, 107, 74, 184, 108, 87, 112, 13, 71, 89, 44, 83, 37, -6, 103, 92, 90, 58, 71, 97, 100, 114, 91, 92, 38, 163, 106, 74, 101, 141, 102, 138, 105, 88, 150, 148, 162, 47, 62, 18, 126, 19, 75, 99]
$$ [...]
14830A57
##ENDNTUPLES=	NMRSPECTRUM
##$OBSERVEDINTEGRALS=	(X Y Z)
(8.8858099224427498086, 8.9158908569618748885, 1)
(8.0595442529919179009, 8.1139459430796705419, 1.1252198423537640437)
(7.881618725410715065, 7.9513808926994897774, 2.2012497790845344525)
(7.4028773405067642699, 7.5699752490795946258, 9.28406213436678307)
(7.8016162399875126354, 7.853457850541746943, 2.1752234494541604626)
##END=	
##TITLE=	R9
##JCAMPDX=	6.0	$$ NMR Plug-in 1.10 of MestReNova 9.0.0-12821
##BLOCKID=	3
##DATATYPE=	NMRPEAKTABLE
##DATACLASS=	PEAKTABLE
##.OBSERVEFREQUENCY=	400.029998779296875
##.OBSERVENUCLEUS=	^1H
##NPOINTS=	46
##FIRSTX=	7.4127599230952299081
##LASTX=	8.9048486963705020258
##XFACTOR=	1
##YFACTOR=	1
##FIRSTY=	109.73134613037109375
##XUNITS=	PPM
##YUNITS=	ARBITRARY UNITS
##PEAKTABLE=	(XY..XY)
7.4127599230952299081, 109.73134613037109375
7.4155638005164288273, 116.75543212890625
7.4212573803135475359, 86.44593048095703125
7.430701417512357132, 610.45245361328125
7.4364577322552243288, 502.804168701171875
7.4429714929693693293, 230.2076873779296875
7.4448055122926390936, 265.797576904296875
7.4479716194642424654, 283.26007080078125
7.450802049910583591, 186.237060546875
7.4537647680384262472, 232.6816253662109375
7.4572360460081474898, 221.057098388671875
7.4597417601873070581, 133.77490234375
7.4757961149832121706, 180.478912353515625
7.4781908734880930822, 249.1486053466796875
7.4808513162394580931, 158.6033782958984375
7.5264433033733819656, 204.01214599609375
7.528952181428171464, 232.686004638671875
7.5309703675570727199, 449.00555419921875
7.5363841986281983054, 141.80987548828125
7.5435786995503528729, 154.62030029296875
7.5477421565461186859, 236.42791748046875
7.5496769522647850792, 174.254486083984375
7.5534934442752366124, 488.926727294921875
7.5608495126791464003, 67.879150390625
7.5644850106725218808, 81.913909912109375
7.5667397288453512871, 73.9097137451171875
7.8106801561104113318, 77.24005126953125
7.8179549773547858393, 499.69482421875
7.8234745508124978741, 141.4356842041015625
7.8350094332336412961, 144.4514923095703125
7.8404643971590806117, 408.17340087890625
7.8477434015231199993, 45.546657562255859375
7.9038759814342602894, 235.891845703125
7.9094359633511901464, 241.54638671875
7.9172316355886200867, 196.8858795166015625
7.9195374970079210897, 164.0211334228515625
7.9228003173520038516, 109.0447235107421875
7.9258230992956022476, 123.06800079345703125
7.9282587680553771037, 187.6866607666015625
8.0744923377161708089, 126.7934417724609375
8.0767216816272675572, 206.25701904296875
8.0789402346438503599, 113.44097900390625
8.095602721206480723, 121.38694000244140625
8.0977948203024681106, 200.65472412109375
8.0999938050856528093, 99.96271514892578125
8.9048486963705020258, 794.13372802734375
##END=	
##END=	
